{"text_format":"1","workbook":"xlsx","n_sheets":4,"sheets":["No Given Grave","Aras_DB","Graveyards","Search "],"not_rendered":{"charts":0,"images":12,"macros":1,"external_links":0,"defined_names":2,"comments":2,"pivot_tables":0},"unopened":[],"bounds":{"document_bytes":16777216,"sheet_cells":100000,"rows_first":2000,"rows_last":500,"rows_between":2000,"halvings":0,"cell_chars":16384,"cell_head_chars":4096},"cells_cut":0,"cells_raw":0,"read":"whole","date_system":"1900"}

{"sheet":"No Given Grave","index":0,"n_rows":551,"n_cols":11,"rows_kept":551,"cut":false,"hidden":true,"merged":[]}
["ID_old","ID","Surname","Chrisian Name","Address","Graveyard Number","Grave Number","Age","Date of Death","Occupation","Any Other Comments"]
[5,1,"Mc Devitt","Patrick","14 Waterloo Street",0,null,68,"04/07/1875","",""]
[6,2,"Quigley","Phillip","Abercorn Road",0,null,77,"19/12/1883","",""]
[7,3,"McClafferty","Mary","21 Abbey Street",0,null,null,"18/12/1883","",""]
[8,4,"Doherty","Winnifred","21 Howard Street",0,null,33,"09/10/1892","","Mothers Address.Husband Daniel Doherty,Mason"]
[2,5,"Mc Donnell","Sarah","10 Linenhall St",0,null,5,"15/10/1892","","Daughter of William Mc Donnell"]
[1,6,"Nugent","Ellen","47 Creggan Street",0,null,0,"13/10/1892","","Uncles Residence."]
[9,7,"Cuthbert","Wliiam","Ferryquay Street",0,null,null,"05/10/1892",""," At Brothers Residence."]
[10,8,"Quigley","Joseph","30 Ivy Terrace",0,null,19,"30/10/1892","","Son of Phillip"]
[11,9,"Friel","Patrick","London Street",0,null,null,"13/08/1892","Merchant of City",""]
[12,10,"Gallagher","Susan","Ballymacarry,Parks",0,null,0,"","","Buncrana,"]
[13,11,"Concannon","Richard","45 WellingtonSt",0,null,null,"18/07/1892","",""]
[14,12,"Mc Keever","John","3 Little Diamond",0,null,0,"02/07/1902","","Son of Patrick Mc Keever"]
[15,13,"Doherty","Bridget","116 Bishop Street",0,null,16,"19/03/1896","","Youngest Daughter of John Doherty Baker."]
[16,14,"Conaghan","Margaret","Linenhall Street",0,null,null,"12/02/1896","","At Mary Margt Harts Residence Linenhall Street"]
[17,15,"Havlin","Catherine","87 St Columbs Wells",0,null,48,"13/03/1896","","Relict of the late Edward"]
[18,16,"Lynch","Edward","42 William  Street",0,null,65,"26/05/1879","",""]
[19,17,"McGettigan","Mary Anne","Ballyougry",0,null,34,"24/05/1879","","Wife of Neal McGettigan"]
[20,18,"Doherty","Ellen","Racecourse",0,null,null,"15/06/1879","","Only Daughter of the late John Doherty"]
[21,19,"Deehan","Mary","75 Rossville Street",0,null,38,"02/06/1879","","Wife of John Deehan Compositor"]
[22,20,"Craig","Anne","Glassaugh",0,null,70,"15/01/1879","","Nee Carolau,wife to George,sister of Thomas."]
[23,21,"McLaughlin","Joseph","66 Rossville Street",0,null,63,"08/01/1869","",""]
[24,22,"Keys","Ellen","",0,null,0,"","",""]
[0,23,"Mc Daid","Patrick","16 Creggan Street",0,null,0,"17/09/1903","Senior Butcher",""]
[26,24,"Gallagher","Richard","Marlborough Tce",0,null,0,"03/09/1907","H.M. Customs.",""]
[27,25,"McDonnell","William","10 Linenhall Street",0,null,0,"29/07/1907","",""]
[28,26,"Doherty","Margaret","Racecourse",0,null,0,"31/01/1874","","Wife of John Doherty"]
[29,27,"Collins","Mary","10 William Street",0,null,null,"10/01/1900","","Daughter of late William Collins"]
[30,28,"Mc Daid","James","39 Bishop Street",0,null,0,"30/10/1896","Butcher",""]
[31,29,"Mc Ginley","Lizzie","126 Bogside",0,null,0,"24/04/1894","","Second daughter of Michael Mc Ginley Builder."]
[3,30,"Macdevette","James","62 William Street",0,null,70,"14/04/1873","",""]
[4,31,"McLaughlin","Margaret","Ferguson Street",0,null,38,"19/03/1873","","Daughter of the late Andrew Mc Laughlin"]
[1,32,"Mehan","James","",1,1,19,"12/02/1851","",""]
[2,33,"Mehan","Joseph","",1,1,2,"15/12/1832","",""]
[3,34,"Mehan","William","",1,1,3,"","",""]
[4,35,"Mehan","Joseph","",1,1,14,"01/01/1846","",""]
[5,36,"Kelly","Cornelius","",1,2,51,"22/03/1833","R.N. Surgeon",""]
[6,37,"Kelly","Thomas Patrick","",1,2,1,"24/06/1823","","Son of No 5"]
[7,38,"Mc Daid","James","",1,3,null,"","",""]
[8,39,"Mc Daid","Ellen","",1,3,null,"10/10/1897","","Wife of No 7"]
[9,40,"Mc Daid","Richard","",1,3,null,"29/04/1916","","Son of No's 7 and 8"]
[10,41,"O'Scally","John","",1,4,68,"11/06/1824","Captain",""]
[11,42,"Mc Feely","Ann","",1,4,25,"06/06/1833","","Daughter of No 10"]
[12,43,"Mc Feely","John","Foyle St",1,4,28,"24/09/1860","","Son of No 11"]
[13,44,"Devlin","Robert","",1,5,34,"13/02/1840","",""]
[14,45,"Devlin","William","",1,5,null,"","","Son of No 13"]
[15,46,"Devlin","James","",1,5,null,"","","Son of No 13"]
[16,47,"Devlin","Maria","",1,5,null,"","","Daughter of No 13"]
[17,48,"Casey","Hugh","",1,6,51,"02/07/1838","",""]
[18,49,"Casey","Margaret","",1,6,21,"19/11/1843",""," Daughter of No 17"]
[19,50,"Doherty","Margaret","",1,6,80,"12/09/1859","","Mother-in-Law to No 17"]
[20,51,"Collins","Anthony","",1,7,51,"16/11/1837","",""]
[21,52,"Collins","Sarah","",1,7,62,"05/05/1844","","Wife of No 20"]
[22,53,"Collins","Anthony","",1,7,36,"02/12/1852","","Son of 20 and 21"]
[23,54,"Collins","Ann","",1,7,17,"21/05/1858","","Grand-daughter of 20 and 21"]
[24,55,"Collins","William","",1,7,73,"11/10/1880","",""]
[25,56,"Collins","Rose","10 Wiliiam Street",1,7,72,"05/10/1885","","Wife of No 24"]
[26,57,"Collins","Catherine","10 William Street",1,7,36,"23/05/1886","","Daughter of No 24 and 25"]
[27,58,"Collins","Mary","",1,7,42,"10/01/1901","","."]
[28,59,"Collins","Anthony","",1,7,null,"28/12/1921","",""]
[29,60,"Mooney","Margaret","",1,8,33,"","",""]
[30,61,"Mooney","Ann","",1,8,42,"","",""]
[31,62,"Mooney","Joseph","",1,8,52,"05/02/1852","",""]
[32,63,"White","Mary Jane","",1,8,27,"16/04/1853","","Daughter of Thomas White"]
[33,64,"Mooney","Jane","",1,8,50,"12/07/1848","",""]
[34,65,"Mooney","Rosa","20 Gt James Street",1,8,76,"02/02/1860","",""]
[35,66,"Hassan","Elizabeth","",1,8,74,"16/02/1870","","Servant to Mooneys 50 yrs"]
[36,67,"Mooney","John","",1,8,64,"02/04/1813","",""]
[37,68,"Mooney","Anne","",1,8,74,"16/06/1827","","Wife of No 36"]
[38,69,"Murray","Thomas","",1,9,null,"","","Burying Ground Only"]
[39,70,"Nugent","John","",1,10,46,"07/03/1848","",""]
[40,71,"Brown","Mary Ann","",1,10,25,"05/03/1850","","Daughter of No 39"]
[41,72,"Brown","John","",1,10,1,"17/06/1849","","Son of No 40"]
[42,73,"Nugent","Mary","5 Foyle St.",1,10,78,"20/05/1877","","Wife of No 39"]
[43,74,"Mc Laughlin","Maggie G","",1,10,26,"05/03/1884","","Granddaughter of No 39"]
[44,75,"Mc Laughlin","Ellen Nugent","",1,10,76,"24/11/1905","","Daughter of No 39"]
[45,76,"Casey","Phillip","",1,11,84,"14/09/1832","",""]
[46,77,"Casey","Cecilia","",1,11,79,"23/03/1843","","Wife of No 45"]
[47,78,"Fleming","Charles","Castle Street",1,12,71,"07/01/1890","",""]
[48,79,"O'Donnell","Thomas","Foyle Road",1,13,87,"27/07/1861","",""]
[49,80,"O'Donnell","Esther","Foyle Road",1,13,74,"21/10/1868","","Wife of No 48"]
[50,81,"O'Donnell","William","Foyle Road",1,13,72,"21/02/1909","","Son of No,s 48 and 49"]
[51,82,"O'Donnell","Mary","Foyle Road",1,13,null,"06/03/1879","","Daughter of No,s 48 and 49"]
[52,83,"O.Donnell","Thomas","Foyle Road",1,13,null,"28/02/1898","","Son of No,s 48 and 49"]
[53,84,"O.Donnell","Esther","Foyle Road",1,13,null,"11/03/1909","","Daughter of No,s 48 and 49"]
[54,85,"Mc Kinney","Ellen","",1,14,15,"07/07/1852","",""]
[55,86,"Doherty","Sarah","",1,15,null,"","","Wife of William Doherty"]
[56,87,"Mc Feely","Bridget","",1,16,28,"19/11/1827","",""]
[57,88,"Mc Feely","Bryan","",1,16,53,"01/05/1850","",""]
[58,89,"Mc Feely","Ellen","",1,16,56,"19/11/1846","",""]
[59,90,"Mc Feely","Mary","Foyle Street",1,16,45,"04/11/1851","",""]
[60,91,"Mc Feely","Michael","",1,16,77,"29/06/1868","",""]
[61,92,"Mc Feely","Michael","Foyle St.",1,16,33,"18/06/1872","","only Surviving Son of Late Michael Mc Feely"]
[62,93,"Keys","George","Creevagh",1,17,99,"15/11/1903","","Uncle of Bp J K O'Doherty"]
[63,94,"Heaney","Bernard","",1,18,57,"19/02/1857","",""]
[64,95,"Heaney","Bridget","9 Henrietta St",1,18,72,"15/12/1862","","Wife of No 63"]
[65,96,"Griffin","Mary Ann","",1,19,25,"13/11/1826","","Wife of Michael Griffin"]
[66,97,"Mc Clean","Dr William","Butcher St Derry",1,20,23,"05/09/1833","",""]
[67,98,"Mc Clean","Charles","",1,20,12,"09/02/1842","","Brother of No 66"]
[68,99,"Mc Clean","Patrick","",1,20,23,"17/02/1850","","Brother of No 66"]
[69,100,"Mc Clean","Neal","Butcher St",1,20,34,"29/01/1851","","Brother of No 66"]
[70,101,"Mc Clean","Neal Snr","Butcher St",1,20,73,"07/04/1851","","Father of No,s 66,67,68,69"]
[71,102,"Doherty","Margaret","",1,21,70,"10/12/1920","",""]
[72,103,"Doherty","Daniel","",1,21,null,"14/12/1914","","Husband of No 71"]
[73,104,"Gill","Ann","",1,null,60,"","",""]
[74,105,"Mc Cafferty","Andrew","Woodlands, Fahan",1,22,69,"16/05/1888","",""]
[75,106,"Mc Cafferty","Margaret","",1,22,79,"18/03/1894","","Wife of No 74"]
[76,107,"Mc Cafferty","Margaret","Victoria Place",1,22,29,"11/10/1873","","Daughter of Andrew, Victoria Place"]
[77,108,"Mc Cafferty","Daniel","",1,22,null,"17/06/1885","",""]
[78,109,"Mc Cafferty","Andrew","",1,22,null,"","","Died in Infancy"]
[79,110,"Mc Cafferty","James","",1,22,null,"","","Died in Infancy"]
[80,111,"Mc Cafferty","Annie","",1,22,null,"","","Died in Infancy"]
[81,112,"Mc Cafferty","Joseph","No Record",1,22,null,"20/11/1885","",""]
[82,113,"Mc Cafferty","Mary","Woodlands, Fahan.",1,22,null,"25/10/1896","",""]
[83,114,"Mc Cafferty","Andrew","18 Clooney terrace",1,22,43,"26/02/1893","Solicitor","Interred in City Cemetery"]
[84,115,"Henry","Henry","",1,22,null,"","","Grandparents"]
[85,116,"Henry","Mary","",1,22,null,"","","to above"]
[86,117,"O'Doherty","Edward","Formerly of Molenan, Died at Whitehouse.",1,23,84,"09/05/1872","","Father of Bp J K O'Doherty"]
[87,118,"O'Doherty","Margaret","",1,23,66,"13/09/1869","","Mother of Bp J K O'Doherty"]
[88,119,"O'Doherty","Margaret Sarah","Molenan",1,23,34,"07/04/1860","","Sister of Bp John Keys O'Doherty"]
[89,120,"Gillespie","James","",1,24,84,"27/01/1874","",""]
[90,121,"Gillespie","Margaret","85 Bishop St",1,24,78,"27/09/1878","","Wife of Late James"]
[91,122,"Gillespie","Alice","",1,24,null,"","","Daughter of No,s 89 and 90"]
[92,123,"Gillespie","Sarah","",1,24,null,"","","Daughter of No,s 89 and 90"]
[93,124,"Gillespie","Ellen","",1,24,null,"","","Daughter of No,s 89 and 90"]
[94,125,"Gillespie","Francis","",1,24,null,"","","Daughter of No,s 89 and 90"]
[95,126,"Gillespie","James","",1,24,null,"","","Son of No,s 89 and 90"]
[96,127,"Gillespie","Lawrence","",1,24,null,"","","Son of No,s 89 and 90"]
[97,128,"Gillespie","John","",1,24,null,"","","Son of No,s 89 and 90"]
[98,129,"Gillespie","Alicia","",1,24,null,"","","Daughter of No,s 89 and 90"]
[99,130,"Gillespie","Isabella","",1,24,null,"","","Daughter of No,s 89 and 90"]
[100,131,"Gillespie","Margaret","",1,24,null,"","","Daughter of No,s 89 and 90"]
[101,132,"Mc Laughlin","Andrew","",1,25,85,"03/03/1871","",""]
[102,133,"Mc Laughlin","Winifred","Ferguson Street",1,25,75,"20/04/1870","","Wife of No 101"]
[103,134,"Mc Laughlin","Michael","",1,25,null,"","","Son of 101 and 102"]
[104,135,"Mc Laughlin","Ellen","",1,25,null,"","","Daughter of 101 and 102"]
[105,136,"Mc Laughlin","Patrick","",1,25,null,"","","Son of 101 and 102"]
[106,137,"Mc Laughlin","Mary","",1,25,null,"","","Daughter of 101 and 102"]
[107,138,"Mc Laughlin","Winifred","",1,25,null,"","","Daughter of 101 and 102"]
[108,139,"Mc Laughlin","Margaret","",1,25,null,"","","Daughter of 101 and 102"]
[109,140,"Mc Laughlin","Michael","",1,25,66,"16/04/1907","","Son 101 and 102"]
[110,141,"Mc Laughlin","Phillip","No Obit",1,26,68,"11/08/1899","Surveyor/Architect",""]
[111,142,"Mc Laughlin","David","",1,26,null,"","","Father of No 110"]
[112,143,"Mc Laughlin","Margaret","",1,26,null,"","","Mother of No 110"]
[113,144,"Mc Monagle","Henry","",1,26,null,"","",""]
[114,145,"McMonagle","Hannah C","",1,26,null,"","","Nee-Mc Laughlin"]
[115,146,"Mc Monagle","Annie","",1,26,null,"01/04/1936","",""]
[116,147,"Mc Monagle","Daniel mc Laughlin","",1,27,null,"","",""]
[117,148,"Hart","William","",1,28,52,"27/10/1848","",""]
[118,149,"Hart","Mary","",1,28,13,"10/11/1840","",""]
[119,150,"Quigley","Edward","",1,29,null,"","",""]
[120,151,"Quigley","John","",1,29,null,"","",""]
[121,152,"Quigley","Joseph","",1,29,null,"","",""]
[122,153,"Quigley","William James","",1,29,23,"10/04/1899","",""]
[123,154,"Quigley","Phillip","",1,29,72,"03/05/1904","","Father of No 119 to 122"]
[124,155,"Quigley","Bridget","",1,29,null,"12/03/1914","","Mother of No 119 to 122"]
[125,156,"Devlin","Mary","",1,30,72,"29/09/1843","",""]
[126,157,"Devlin","John","14 Abercorn Road",1,30,null,"29/04/1894","",""]
[127,158,"Devlin","Kate","Nazareth House, Derry.",1,30,null,"18/07/1899","","Daughter of Late Jphn Devlin, Waterside, Merchant."]
[128,159,"Devlin","Mary","Nazareth House, Derry.",1,30,null,"05/07/1900","","Daughter of Late John Devlin, Waterside."]
[129,160,"Mc Collum","John","",1,31,23,"18/04/1948","",""]
[130,161,"Mc Collum","Bernard","Rossville St",1,31,35,"22/10/1867","",""]
[131,162,"Mc Collum","Margaret","",1,31,null,"","",""]
[132,163,"Doherty","Denis","",1,32,null,"14/10/1848","",""]
[133,164,"Doherty","Charity","Shipquay St",1,32,null,"17/05/1864","",""]
[134,165,"Doherty","Catherine","Shipquay St",1,32,null,"03/10/1848","",""]
[135,166,"Doherty","George","",1,32,null,"20/07/1847","",""]
[136,167,"Doherty","Francis","",1,32,null,"11/01/1851","",""]
[137,168,"Doherty","Denis","",1,32,null,"","",""]
[138,169,"Doherty","Anny","",1,32,null,"","",""]
[139,170,"Doherty","Ellen","",1,32,null,"","",""]
[140,171,"Doherty","Mary Eliza","",1,32,null,"","",""]
[141,172,"Gallagher","Neal","",1,33,68,"","",""]
[142,173,"Stirke","Eliza","",1,34,28,"02/03/1843","","Wife of Lieut Stirke 11th Regiment"]
[143,174,"Devlin","Michael","No Issue.",1,35,84,"04/11/1872","",""]
[144,175,"Devlin","Sarah","137 Bishop St Without",1,35,76,"20/04/1875","","Wife of No 143"]
[145,176,"Devlin","Cornelius","137 Bishop St Without",1,35,43,"01/05/1874","","Son of No,s 143 and 144."]
[146,177,"Devlin","Michael","",1,35,null,"12/02/1912","","Son of No,s 143 and 144"]
[147,178,"Fallon","Eleanor","",1,35,null,"10/02/1926","","Daughter of No,s 143 and 144."]
[148,179,"Mc Laughlin","Daniel","",1,36,null,"","",""]
[149,180,"Mc Laughlin","","",1,36,null,"","",""]
[150,181,"Mc Dermott","John","12 Waterloo St",1,37,58,"08/04/1872","",""]
[151,182,"Mc Dermott","Margery","",1,37,42,"25/12/1860","",""]
[152,183,"Mc Dermott","Henry","",1,37,null,"","","Son of No,s 150 and 151"]
[153,184,"Mc Dermott","Mary-Ann","",1,37,null,"","","Daughter of No,s 150 and 151"]
[154,185,"Mc Dermott","Margery","",1,37,null,"","","Daughter of No,s 150 and 151"]
[155,186,"Mc Dermott","Joseph","",1,37,null,"","","Son of No,s 150 and 151"]
[156,187,"Mc Dermott","Edward","",1,37,null,"","","Son of No,s 150 and 151"]
[157,188,"Mc Dermott","Elizabeth","",1,37,null,"","","Daughter of No,s 150 and 151"]
[158,189,"Mc Dermott","Margaret","",1,37,null,"","","First Wife of No 150"]
[159,190,"Campbell","Bernard","",1,38,72,"12/02/1842","",""]
[160,191,"Campbell","Mary","",1,38,84,"24/08/1848","","Wife of No 159"]
[161,192,"Campbell","Mary","",1,38,1,"","","Grandchild of 159 and 160"]
[162,193,"Campbell","George","",1,38,9,"13/03/1849","","Grandchild of 159 and 160"]
[163,194,"Campbell","Patrick","Fountain St",1,38,61,"17/07/1866","","Son of No,s 159 and 160"]
[164,195,"Campbell","James","",1,38,69,"17/02/1871","","Son of No,s 159 and 160"]
[165,196,"Campbell","Mary","??????????????check John  Fountain St.",1,38,40,"28/10/1878","","Wife of No 164"]
[166,197,"Bradley","Patrick","",1,39,82,"22/03/1836","",""]
[167,198,"Bradley","Susannah","",1,39,72,"07/02/1835","","Wife of No 166"]
[168,199,"Bradley","Anne","",1,39,37,"04/03/1835","","Daughter of No,s 166 and 167"]
[169,200,"Bradley","Susannah","",1,39,59,"19/07/1851","","Daughter of No,s 166 and 167"]
[170,201,"Bradley","James","",1,39,37,"29/07/1832","","Son of No,s 166 and 167"]
[171,202,"Bradley","Ann","",1,39,38,"19/06/1841","","Wife of No 170"]
[172,203,"Bradley","Ann","",1,39,null,"","","Daughter of No,s 170 and 171"]
[173,204,"Bradley","Patrick","",1,39,null,"","","Son of No,s 170and 171"]
[174,205,"Bradley","Daniel","",1,39,null,"","","Son of No,s 170 and 171"]
[175,206,"Bradley","James","",1,39,null,"","","Son of No,s 170 and 171"]
[176,207,"Bradley","Catherine","",1,39,null,"","","Daughter of No,s 170 and 171"]
[177,208,"Bradley","Anne","Society St",1,39,32,"09/10/1851","","Wife of Patrick Bradley of city"]
[178,209,"Bradley","Ann","",1,39,2,"16/12/1848","","Daughter of No 177"]
[179,210,"Bradley","Mary Elizabeth","",1,39,3,"14/03/1853","","Daughter of No 177"]
[180,211,"Bradley","Ellen","",1,39,19,"14/01/1865","","Daughter of No 177"]
[181,212,"Bradley","Susan D M","Sunnyside",1,39,19,"31/01/1867","","Daughter of No 177"]
[182,213,"Bradley","Patrick","",1,39,83,"23/07/1884","",""]
[183,214,"Mc Bride","Catherine","East Wall",1,40,40,"12/07/1866","",""]
[184,215,"Mc Bride","James","",1,40,null,"","","Son of No,s 183 and 190"]
[185,216,"Mc Bride","Harriet","",1,40,null,"","","Daughter of No,s 183 and 190"]
[186,217,"Mc Bride","Sarah","",1,40,null,"","","Daughter of No,s 183 and 190"]
[187,218,"Mc Bride","Elizabeth","",1,40,null,"","","Daughter of No,s 183 and 190"]
[188,219,"Mc Bride","William","",1,40,7,"","",""]
[189,220,"Mc Bride","James","",1,40,null,"08/01/1875","","Husband of No 183"]
[190,221,"McNulty","James","",1,40,null,"","","Grand-Son of No,s 183 and 189"]
[191,222,"Mc Nulty","Mary","",1,40,null,"","","Grand-Daughter of No,s 183 and 190"]
[192,223,"Mc Bride","Charles","Glenview House Edenballymore",1,40,30,"02/04/1886","","Son of No,s 183 and 190"]
[193,224,"Kearney","Daniel","",1,41,76,"11/05/1850","",""]
[194,225,"Kearney","Daniel","William St",1,41,null,"11/09/1860","Lessee Brdg Tolls","Husband of No 193"]
[195,226,"Kearney","Grace","William St",1,41,86,"12/01/1863","","Wife of No 193"]
[196,227,"Carson","John","",1,41,3,"23/12/1842","",""]
[197,228,"Mc Elheran","","",1,42,null,"","",""]
[198,229,"Murphy","John","",1,43,null,"","",""]
[199,230,"Shields","D","",1,44,null,"","",""]
[200,231,"Mc Sheffrey","Charles","",1,45,66,"","",""]
[201,232,"Mc Keown","Hugh","",1,46,80,"06/06/1868","",""]
[202,233,"Mc Keown","Edward","",1,46,67,"15/05/1898","",""]
[203,234,"Mc Keown","Margaret","",1,46,62,"24/05/1898","",""]
[204,235,"Rogers","Sarah Josephine","33 Foyle St",1,47,55,"12/03/1874","",""]
[205,236,"Rogers","Mary Josephine","",1,47,19,"11/07/1873","","Daughter of No 204 & Charles"]
[206,237,"Rogers","John Joseph","",1,47,1,"12/03/1852","","Son of No 204"]
[207,238,"Ward","James","",1,48,24,"05/03/1833","",""]
[208,239,"Ward","William","",1,48,28,"20/01/1841","",""]
[209,240,"Ward","Sarah","",1,48,76,"12/05/1903","",""]
[210,241,"Ward","Mary","40 Rossville St",1,48,16,"05/01/1875","","Daughter of Michael Ward."]
[211,242,"Ward","Sarah","",1,48,36,"03/04/1898","",""]
[212,243,"Ward","Michael","41 Elmwood Terrace",1,48,78,"23/03/1903","",""]
[213,244,"O'Donnell","Susan","",1,49,70,"02/03/1854","",""]
[214,245,"O'Donnell","Daniel","",1,49,32,"25/01/1850","","maybe 1860 Son of 213"]
[215,246,"O'Donnell","John","",1,49,80,"17/03/1863","","Husband of 213"]
[216,247,"O'Donnell","Catherine","Kildrum",1,49,31,"01/08/1870","","Wife of 217"]
[217,248,"O'Donnell","John","",1,49,71,"16/03/1898","","maybe 1899 Husband of 216"]
[218,249,"Gallagher","James","",1,50,63,"05/06/1813","",""]
[219,250,"Gallagher","Mary","",1,50,82,"05/04/1830","",""]
[220,251,"Gallagher","Patrick","",1,50,22,"08/01/1841","",""]
[221,252,"Gallagher","Edward","",1,50,72,"09/11/1871","","son of 218 & 219 father of 220"]
[222,253,"Gallagher","Sarah","",1,50,73,"01/11/1866","","wife of 221"]
[223,254,"Gallagher","Mary","No Death Notice",1,50,48,"15/01/1872","","daughter of 220 & 221"]
[224,255,"Gallagher","Theresa","No Death Notice",1,50,73,"16/08/1905","",""]
[225,256,"Flanagan","John","No Death Notice",1,51,null,"21/04/1888","",""]
[226,257,"Hart","Anne","Linenhall St",1,52,44,"20/01/1871","","Erected by Philip Lynch"]
[227,258,"Doherty","Hugh","21 Creggan St",1,53,3,"23/03/1876","","Father Michael"]
[228,259,"Doherty","Michael J","21 Creggan St",1,53,1,"27/03/1876","","Father Michael"]
[229,260,"McBride","Catherine","",1,54,null,"12/07/1866","",""]
[230,261,"McBride","James","",1,54,null,"08/01/1875","","Husband to 229"]
[231,262,"McBride","Charles","",1,54,30,"02/04/1886","",""]
[232,263,"Murray","John","",1,55,55,"10/04/1850","",""]
[233,264,"Murray","Maria","21 Francis St",1,55,72,"15/03/1874","","Wife of John Murray."]
[234,265,"Kearney","Christian","",1,56,23,"10/11/1823","",""]
[235,266,"Brisland","John","",1,57,65,"21/11/1826","",""]
[236,267,"McDonough","Ellen","",1,57,null,"","","Wife of 235"]
[237,268,"Doherty","Daniel","",1,null,null,"","",""]
[238,269,"McBride","Hannah","",1,59,80,"01/04/1869","",""]
[239,270,"McBride","Patrick","Richmond St.",1,59,80,"19/07/1872","",""]
[240,271,"Mehan","Rose","",1,60,21,"21/11/1836","",""]
[241,272,"McLoughlin","Marcus","Possible Bridget?",1,61,null,"12/05/1836","",""]
[242,273,"McLoughlin","John Casey","",1,61,null,"27/11/1843","",""]
[243,274,"Shearen","Catherine","",1,62,18,"17/03/1865","",""]
[244,275,"Sweney","James","",1,63,null,"","","Burying ground"]
[245,276,"Murray","Denis","",1,64,71,"16/02/1833","",""]
[246,277,"Freeman","Catharine","",1,65,80,"04/03/1831","",""]
[247,278,"Rogers","Sarah Josephine","",1,66,55,"12/03/1874","","Wife of Charles"]
[248,279,"Rogers","Mary Josephine","",1,66,19,"11/07/1873","",""]
[249,280,"Rogers","John Joseph","",1,66,1,"12/03/1852","",""]
[250,281,"O'Donnell","Edward","",1,null,null,"","",""]
[251,282,"O'Donnell","Sarah","",1,null,null,"","",""]
[252,283,"O'Donnell","Edward","",1,null,null,"","","Son of 250 & 251"]
[253,284,"O'Donnell","Charles","",1,null,null,"","","Son of 250 & 251"]
[254,285,"O'Donnell","Sarah","",1,null,null,"","","Daughter of 250 & 251"]
[255,286,"Hart","Margaret","",1,68,46,"27/01/1829","",""]
[256,287,"Hart","John","",1,68,78,"12/11/1851","",""]
[257,288,"Hart","Mary","City Hotel",1,69,15,"25/09/1860","",""]
[258,289,"Hart","William","Linenhall St.Mate Foyle Steamer",1,70,52,"26/10/1848","River Pilot","Between Liverpool and Derry"]
[259,290,"Mc Loughlin","William","Castle St",1,71,50,"03/01/1861","Doctor",""]
[260,291,"Murray","Dennis","",1,72,71,"16/02/1833","",""]
[261,292,"Sweney","James","",1,73,null,"","",""]
[262,293,"Shearen","Catherine","",1,74,18,"17/03/1865","",""]
[263,294,"Coyle","D","Harvey St",1,0,75,"09/09/1860","","Grave Unknown"]
[264,295,"Mc Ginley","Sarah Anne","124 Long Bogside",1,0,0,"01/02/1867","","Grave Unknown"]
[265,296,"Mc Closkey","John James","",1,75,20,"28/07/2008","","Year still to be determined"]
[266,297,"Rowan","William","Artillery Lane",1,76,null,"04/03/1853","",""]
[267,298,"Rowan","Catherine","",1,76,17,"","",""]
[11,299,"Doherty","William","",2,8,48,"18/03/1848","",""]
[12,300,"Doherty","William","No Obit",2,9,30,"24/09/1870","",""]
[13,301,"Rogers","Edward","",2,10,36,"03/07/1850","",""]
[14,302,"Doherty","Elizabeth","No Obit",2,11,0,"14/07/1864","",""]
[15,303,"McCormick","John","",2,12,64,"","",""]
[16,304,"McCormick","Bridget","",2,12,null,"","",""]
[17,305,"Coyle","James","",2,13,32,"26/12/1817","",""]
[18,306,"Bradley","Peter","No Obit",2,14,60,"12/02/1866","",""]
[19,307,"Fox","Ann","",2,15,null,"","",""]
[20,308,"Fox","Thomas","",2,15,null,"01/01/1820","","Day and month inaccurate"]
[21,309,"Campbell","Mary","No Obit",2,16,36,"12/01/1849","",""]
[22,310,"McCool","James","No Obit",2,17,null,"18/10/1870","",""]
[23,311,"Brogan","Elenor","",2,18,48,"08/03/1867","",""]
[24,312,"Brogan","Margaret","",2,18,18,"08/03/1867","",""]
[25,313,"Deerin","Sarah","",2,19,16,"17/05/1852","",""]
[26,314,"Carlin","John","Braehead",2,20,67,"02/09/1892","",""]
[27,315,"Carlin","Thomas","Glashaugh",2,20,85,"02/11/1894","",""]
[28,316,"Reid","John","",2,21,46,"28/01/1857","",""]
[29,317,"Ferguson","Cecilia","",2,21,14,"22/07/1874","",""]
[30,318,"Reid","Ellen","",2,21,34,"27/04/1877","",""]
[31,319,"Mullen","Rose","Cowbog Street",2,22,16,"04/10/1861","","2nd Daughter of Alex Mullen"]
[32,320,"Mullen","Alexander","Waterloo St",2,22,48,"30/10/1863","Whitesmith",""]
[33,321,"Mullen","Mary Therese","",2,22,17,"","","Refer to book"]
[34,322,"Dougan","Owen","",2,23,50,"15/04/1821","",""]
[35,323,"Dougan","Michael","",2,23,22,"22/10/1840","",""]
[36,324,"Bell","M","",2,24,null,"","",""]
[37,325,"Bell","Anne","",2,24,null,"","",""]
[38,326,"Bell","John","",2,24,null,"","",""]
[39,327,"Bell","Hugh","",2,24,null,"","",""]
[40,328,"Bell","Hugh","202 Bishop Street",2,25,null,"01/07/1937","",""]
[41,329,"Bell","Frances","",2,25,null,"02/01/1948","",""]
[42,330,"Doherty","John","",2,26,73,"21/02/1877","",""]
[43,331,"Doherty","Ann","",2,26,80,"04/02/1901","",""]
[44,332,"Doherty","Ann","",2,26,38,"08/03/1907","","Daughter of 42 & 43"]
[45,333,"Hibbits","William","",2,27,78,"11/05/1825","","Refer to book for obit"]
[46,334,"Bradley","Henry","Creggan Street",2,28,0,"","",""]
[47,335,"Bradley","Catherine","Creggan Street",2,28,0,"30/07/1931","",""]
[48,336,"Bradley","Jennie","",2,28,0,"13/12/1904","",""]
[49,337,"Bradley","Fannie","",2,28,0,"26/05/1914","",""]
[50,338,"Bradley","John","",2,28,0,"11/08/1915","",""]
[51,339,"Bradley","Cassie","",2,28,0,"27/02/1936","",""]
[52,340,"McCormick","John","",2,29,56,"02/12/1810","",""]
[53,341,"McCormick","Ann","",2,29,48,"27/08/1837","",""]
[54,342,"McCormick","Sophia","",2,29,2,"25/09/1818","",""]
[55,343,"Breslan","William","",2,30,18,"10/05/1872","","Son of 56 & 57"]
[56,344,"Breslan","Catherine","15 Long Tower Street",2,30,null,"17/04/1892","",""]
[57,345,"Breslan","James","",2,31,null,"21/03/1900","",""]
[58,346,"O'Hagan","William","21 Orchard St",2,31,null,"02/11/1889","","late of Creevagh"]
[59,347,"O'Hagan","Margaret","Creevagh",2,31,null,"","",""]
[60,348,"O'Hagan","Bernard","Creevagh",2,31,null,"","",""]
[61,349,"O'Hagan","Annie","Creevagh",2,31,null,"","",""]
[62,350,"O'Hagan","Ellen","Creevagh",2,31,null,"","",""]
[63,351,"O'Hagan","James","Creevagh",2,31,null,"","",""]
[64,352,"O'Hagan","Rebecca","Creevagh",2,31,null,"","",""]
[74,353,"Smith","Bridget","",2,4,49,"04/02/1859","",""]
[75,354,"Smith","Michael","",2,4,44,"12/01/1852","",""]
[1,355,"Mc Connelogue","Ann","",2,1,48,"23/03/1825","",""]
[2,356,"O'Gorman","Catherine","",2,2,null,"04/12/1858","",""]
[3,357,"O'Gorman","Metthew","",2,2,32,"11/02/1816","",""]
[4,358,"Halferty","Rose","",2,3,0,"","",""]
[5,359,"Smith","John","",2,4,32,"11/02/1816","",""]
[6,360,"Mc Laughlin","Elanor","No Obit",2,5,2,"06/12/1845","",""]
[7,361,"Mc Laughlin","John","No Obit",2,6,63,"22/06/1854","",""]
[8,362,"Logue","Patrick","",2,7,null,"","",""]
[9,363,"Logue","Mary","",2,7,null,"","",""]
[10,364,"Logue","Charles Hugh","",2,7,null,"","",""]
[65,365,"Kate","Toye","Myrtle Villa Northland Rd",2,31,null,"15/04/1912","Wife of E.J.Toye Architect","Late of Creevagh"]
[66,366,"Concannon","John","56 Deanery St",2,32,72,"19/03/1941","",""]
[67,367,"Concannon","Margaret","56 Deanery St",2,30,80,"02/02/1950","",""]
[68,368,"Doherty","Joseph","",2,null,null,"","",""]
[69,369,"Blaney","P O'Hagan","",2,31,0,"17/10/1907","Catholic Curate","Died on Holiday in Dublin"]
[70,370,"Doherty","Mary Jane","Burnfoot Co Donegal",2,32,79,"02/09/1958","",""]
[71,371,"Brown","Jane","",2,33,50,"12/12/1862","",""]
[72,372,"Brown","William","",2,33,63,"13/06/1877","",""]
[73,373,"Durnin","P","",2,0,0,"","",""]
[1,374,"Gillespie","Jane","",3,1,63,"08/05/1834","","Might be March"]
[2,375,"Gillespie","Elleznor","",3,1,0,"","",""]
[3,376,"Gillespie","Mary","",3,1,0,"","",""]
[4,377,"Gillespie","Paul","",3,1,77,"01/02/1843","",""]
[5,378,"Hannigan","Bryan","",3,2,63,"","","Born 1784 Died 1847"]
[6,379,"McLaughlin","Cornelius","Foyle Hill",3,3,0,"","",""]
[7,380,"McLaughlin","James","Foyle Hill",3,3,0,"","",""]
[8,381,"McLaughlin","Bridget","Foyle Hill",3,3,0,"","",""]
[9,382,"Mulrine","Edward","",3,4,0,"","","Died 1816"]
[10,383,"O'Donnell","Bridget","",3,4,0,"","","Died 1817"]
[11,384,"Morrison","Susan","",3,4,0,"","","Died 1830"]
[12,385,"Watson","Catherine","",3,4,0,"","","Died 1843"]
[13,386,"Perry","Rebecca","",3,4,0,"","","Died 1844"]
[14,387,"Hutton","John","",3,5,0,"04/09/1952","","Ordained June 1933"]
[15,388,"O'Donnell","John","",3,6,62,"29/05/1852","",""]
[16,389,"Hill","John","",3,7,0,"","",""]
[17,390,"Hill","James","",3,7,0,"","",""]
[18,391,"Hill","Bridget","",3,7,0,"","",""]
[19,392,"Garland","James","",3,8,42,"10/05/1842","",""]
[20,393,"Gallaugher","Salley","",3,9,32,"22/02/1839","",""]
[21,394,"Mulhearn","Neal","",3,10,27,"18/01/1852","","Erected by his Mother,Margaret."]
[22,395,"Daly","Batheldes","",3,11,26,"24/06/1904","Nazareth Nun","Born 17/03/1878 at Benefrehan"]
[23,396,"Crowley","Mary","",3,11,52,"19/04/1910","Nazareth Nun","Born 03/05/1858 Farrenfore,Co Kerry"]
[24,397,"Loughrey","Mary Thecla","",3,11,39,"17/09/1904","Nazareth Nun","Born15/01/1865 Ballynacargy,Co Westmeath"]
[25,398,"Regan","Mary Ruperta","",3,11,53,"11/11/1925","Nazareth Nun","Born 09/06/1872 Desertmartin,Co Derry"]
[26,399,"Maguire","Mary Zita","",3,11,54,"25/05/1926","Nazareth Nun","Born 15/03/1872 Corodorona Co Cavan"]
[27,400,"Walsh","Mary Regis","",3,11,81,"20/11/1930","Nazareth Nun","Born 02/02/1849 Croom Co Limerick"]
[28,401,"Mulholland","Mary Modesta","",3,11,57,"18/03/1931","Nazareth Nun","Born 21/07/1873 Moneymore Co Derry"]
[29,402,"Curtain","John of Matha","",3,11,60,"04/07/1935","Nazareth Nun","Born 01/10/1874 Abbeyfeale Co Limerick"]
[30,403,"Dempsey","Theresa","",3,11,56,"28/05/1940","Nazareth Nun","Born 10/11/1883 Croagh Co Limerick"]
[31,404,"Collins","Mary Lucis","",3,11,59,"21/06/1940","Nazareth Nun","Born 31/03/1881 Ballynabrackey Co Meath."]
[32,405,"Mc Kenna","Mother St Eliz","",3,11,65,"21/08/1942","Nazareth Nun","Born 01/03/1877 Maghera Co Derry"]
[33,406,"Lynch","M Myron","",3,11,53,"30/01/1948","Nazareth Nun","Born 17/02/1894 Drumshanbo, Co Leitrim"]
[34,407,"Ronan","Prudentia","",3,11,87,"13/06/1948","Nazareth Nun","Born 31/03/1860 Dublin."]
[35,408,"Brady","Joseph","",3,11,66,"23/03/1949","Nazareth Nun","Born 28/10/1882 Ballyduddy Co Longford."]
[36,409,"Farrelly","Agnes","",3,11,76,"26/04/1949","Nazareth Nun","Born 28/07/1872 Belfast."]
[37,410,"Cassidy","Joseph Augustine","",3,11,88,"12/06/1968","Nazareth Nun","Born 27/03/1880 Maghera Co Derry"]
[38,411,"Timony","Mary de Sales","",3,11,81,"20/12/1962","Nazareth Nun","Born 22/03/1881 Belfast"]
[39,412,"Martin","Mary Sylvester","",3,11,72,"20/10/1964","Nazareth Nun","Born 02/02/1894 Carrickmacross Co Monaghan"]
[40,413,"O'Beirne","Mary Thomas","",3,11,63,"11/10/1965","Nazareth Nun","Born 28/02/1902 London"]
[41,414,"O'Kane","Columba Mary","",3,11,81,"01/08/1975","Nazareth Nun","Born 03/08/1893 Claudy Co Derry"]
[42,415,"Brady","Agnes Gabriel","",3,11,72,"15/09/1979","Nazareth Nun","Born 21/03/1907 Lismulligan Co Down."]
[43,416,"Ward","Mary of the Rosary","",3,11,83,"03/05/1962","Nazareth Nun","Born 26/05/1978 Glenties Co Donegal"]
[44,417,"Harbison","Mary Alexander","",3,11,84,"11/12/1963","Nazareth Nun","Born 28/03/1879 Moneymore Co Down"]
[45,418,"Conaghan","Mary Arsenius","",3,11,73,"19/02/1966","Nazareth Nun","Born 11/06/1892 Claggan Co Donegal"]
[46,419,"Mc Mullan","Teresa Agnes","",3,11,81,"11/02/1968","Nazareth Nun","Born 03/06/1886 Moville Co Donegal."]
[47,420,"Hickey","Thomas D","",3,12,56,"17/05/1974","Christian Bro.",""]
[48,421,"Croghan","Joseph","",3,13,83,"25/02/1912","Christian Bro.","Hailed from Roscommon"]
[49,422,"Burgess","George Stanley","",3,14,73,"22/05/1978","Christian Bro.",""]
[50,423,"Mc Faden","Anne","",3,15,55,"28/06/1842","",""]
[51,424,"Farren","Daniel","",3,16,28,"","",""]
[52,425,"Mc Dermott","James","",3,17,null,"","",""]
[53,426,"Boyle","Ellen","",3,18,55,"23/03/1859","",""]
[54,427,"Breslan","James","15 Long Tower St",3,0,0,"27/03/1899","Slater",""]
[45,428,"O'Doherty","Sarah","",4,19,70,"01/03/1822","",""]
[46,429,"Duddy","Ellen","No Obit",4,20,30,"08/02/1879","",""]
[47,430,"Red???","Ja's","",4,21,null,"29/01/1799","",""]
[48,431,"O'Cahan","Rose","",4,22,41,"27/07/1779","",""]
[49,432,"McCafferty","James","",4,23,72,"","","died 1791"]
[50,433,"McCafferty","Susanna","",4,23,52,"","","died 1786"]
[51,434,"McCafferty","Patrick","",4,23,87,"","","died 1843"]
[52,435,"Neely","Charles","",4,24,46,"18/02/1840","",""]
[53,436,"Neely","Elizabeth","No Obit",4,24,79,"21/01/1865","",""]
[54,437,"Concannon","Robert Joe","56 Deanery Street",4,25,null,"05/05/1921","","Eldest son of John"]
[55,438,"Concannon","Annie","56 Deanery Street",4,25,null,"17/05/1925","","4th Daughter of John and Margaret"]
[56,439,"Concannon","John","56 Deanery Street",4,25,null,"19/03/1941","Docker","Husband of Margeret"]
[2,440,"Donnelly","Anne","No Obit",4,2,24,"25/03/1867","",""]
[4,441,"Murphy","William","",4,4,52,"08/01/1857","",""]
[5,442,"Murphy","Bridget","No Obit",4,4,22,"20/05/1849","",""]
[6,443,"Kelpie","Patrick","No Obit",4,5,48,"26/07/1880","",""]
[7,444,"Kelpie","Adelaide","No Obit",4,5,36,"22/04/1873","",""]
[8,445,"Carolan","Patrick","No Obit",4,6,66,"20/04/1859","",""]
[9,446,"Carolan","Hanna","",4,6,0,"","",""]
[10,447,"Mc Sheffry","John","",4,7,40,"","",""]
[11,448,"Doherty","John","No Obit",4,8,1,"20/07/1875","",""]
[12,449,"Doherty","Bridget","116 Bishop St",4,8,16,"19/03/1896","","Youngest Daughter John Doherty Baker"]
[13,450,"Doherty","John","Bishop Street",4,8,70,"05/11/1916","Baker",""]
[14,451,"Doherty","Anne","116 Bishop St",4,8,null,"23/03/1919","","Wife of No 13"]
[15,452,"Doherty","Elizabeth","114 Bishop St.",4,8,null,"19/03/1920","","Oldest Daughter of No 13"]
[16,453,"Doherty","Margaret","114 Bishop St.",4,8,null,"19/03/1922","","Third Daughter of No 13 He was a Master baker."]
[17,454,"Grieve","William","93 Bishop St",4,9,null,"21/05/1922","","Hailed From Claudy"]
[18,455,"Grieve","Margaret","93 Bishop St.",4,9,58,"23/08/1897","","Died In Buncrana, Sis of Pat McMonagle Butcher St"]
[19,456,"Quigley","Philip","Abercorn Road",4,11,null,"19/12/1883","",""]
[20,457,"Quigley","Emma","9 Abercorn Road",4,11,null,"16/02/1889","","Relict of Phillip Quigley"]
[21,458,"Quigley","William","9 Abercorn Road",4,11,null,"14/08/1902","Joiner","City and County infirmary result of accident"]
[22,459,"Hannigan","Sarah","No Obit",4,12,74,"08/01/1847","",""]
[23,460,"Hanagan","Neal","Bennet St",4,12,91,"15/09/1864","",""]
[24,461,"Browne","Stephen","",4,null,null,"","",""]
[25,462,"Browne","Ellen","",4,null,null,"","",""]
[26,463,"Browne","Dorothea","",4,null,null,"","",""]
[27,464,"Browne","Ellen","",4,null,null,"","",""]
[28,465,"Browne","William","Bishop St Fountain St",4,13,72,"18/12/1892","Butcher",""]
[29,466,"McLaughlin","Catherine","No Obit",4,14,1,"01/04/1846","",""]
[30,467,"McLaughlin","Elizabeth","",4,14,6,"","",""]
[31,468,"Gallagher","Rose Ann","No Obit",4,15,null,"01/06/1849","","Erected by her son Richard Gallagher, son"]
[32,469,"Gallagher","Margaret","No Obit",4,15,null,"01/03/1859","",""]
[33,470,"Gallagher","Susan","Ballymacarry Parks",4,15,null,"10/08/1892","","Buncrana.Wife Richard Gallagher Castle Gate Build"]
[34,471,"Gallagher","Lucinda","Woodlands,Fahan",4,15,null,"18/09/1903","","Wife of Richard Gallagher Waterloo Street"]
[35,472,"Gallagher","Richard","Castle Gate Buildings",4,15,null,"10/11/1908","Victualler",""]
[36,473,"Concannon","John","",4,16,53,"","",""]
[37,474,"Concannon","Andrew","",4,16,1,"","","Grandson to No 36."]
[38,475,"Canning","Elizabeth","",4,17,70,"05/04/1857","",""]
[39,476,"Canning","Henry","",4,17,17,"05/04/1857","",""]
[40,477,"Canning","Anthony","",4,17,null,"","","Died 1857"]
[41,478,"Doherty","Richard","",4,18,null,"","",""]
[42,479,"Doherty","Mary","",4,18,null,"","",""]
[43,480,"Doherty","Bernard","",4,18,null,"","",""]
[44,481,"Doherty","Daniel","",4,18,null,"","",""]
[1,482,"Mc Calley","Barbara","No Obit",4,1,66,"17/01/1859","",""]
[1,483,"Mc Laughlin","Charles","No Obit",5,1,49,"12/12/1855","",""]
[2,484,"Donaghey","","",5,2,null,"","",""]
[3,485,"Doyle","Anne","",5,3,80,"26/10/1827","",""]
[4,486,"McCloskey","Rodger","",5,4,30,"28/06/1850","",""]
[5,487,"Fleming","Charles","",5,5,27,"27/10/1840","",""]
[6,488,"Fleming","Margaret","",5,5,2,"16/02/1850","",""]
[7,489,"Coyle","Angela","No Obit",5,6,1,"02/10/1854","",""]
[8,490,"Coyle","Daniel","No Obit",5,6,7,"24/11/1858","",""]
[9,491,"Sawers","Francis","",5,7,null,"","","Died approx 1845"]
[10,492,"Nellis","John","No Obit",5,8,75,"05/03/1858","",""]
[11,493,"Nellis","Ellen","No Obit",5,8,75,"02/07/1864","",""]
[12,494,"Doherty","Mary Ann","109 St Columbs Wells",5,9,14,"22/11/1896","",""]
[13,495,"Doherty","Wee Winnie","Howard St",5,9,4,"14/09/1895","","Sister of 12"]
[14,496,"McElwee","Denis","No Obit",5,10,37,"26/12/1848","",""]
[15,497,"O'Flynn","Joseph","164 Bishop Street",5,11,5,"02/04/1877","","Born 01/04/1872 3rd son of Bernard O'Flynn formerl"]
[16,498,"O'Flynn","Ida","5 Brandywell Ave",5,11,null,"02/11/1919","","Daughter of 17 & 18,Buried in City Cemetery"]
[17,499,"O'Flynn","Winifred","5 Brandywell Ave",5,11,null,"16/02/1932","","Mother of No 16"]
[18,500,"O'Flynn","Thomas","5 Brandywell Ave",5,11,null,"15/01/1941","","Father of No 16"]
[19,501,"O'Kane","Daniel B","9 Victoria Tce Artillery St",5,12,null,"31/10/1895","","Obit on Gravestone Page 54"]
[20,502,"Gallagher","Mary Ann","37 Waterloo St",5,13,null,"02/03/1905","Fleshers daughter",""]
[21,503,"Hegarty","Eleanor","No Obit",5,14,78,"04/01/1855","","Mother of James Hegarty"]
[22,504,"Hegarty","Frances Martena","Diamond",5,14,1,"08/10/1868","","Daughter of James Hegarty"]
[23,505,"McMahon","John","4 Brandywell Rd",5,15,72,"06/05/1912","","Eldest Son of Patrick"]
[24,506,"McMahon","Margaret","No Obit",5,15,35,"25/02/1877","","Wife of 23"]
[25,507,"Kerr","A","",5,16,null,"","",""]
[26,508,"Hegarty","Mary","",5,17,79,"15/01/1850","",""]
[27,509,"Elliott","Thomas","",5,18,null,"","",""]
[28,510,"Gallagher","Mary","",5,19,62,"04/12/1850","",""]
[29,511,"McLaughlin","James","",5,20,null,"","",""]
[30,512,"McLaughlin","Charles","",5,20,null,"","",""]
[31,513,"McDermott","Fanny","",5,20,51,"06/05/1851","","Wife toTommy McDermott"]
[32,514,"McDermott","Roseanne","",5,21,null,"","","Died young"]
[33,515,"Conway","Alice","No Obit",5,22,48,"03/01/1848","",""]
[34,516,"Conway","John","No Obit",5,22,58,"17/05/1859","",""]
[35,517,"Boyle","Sarah","No Obit",5,23,null,"19/01/1847","",""]
[36,518,"Murphy","Francis","No Obit",5,24,75,"21/02/1854","",""]
[37,519,"Peake","Anne","",5,25,20,"29/03/1863","",""]
[38,520,"Boyle","Daniel","No Obit",5,26,null,"","",""]
[39,521,"White","Elizabeth","No Obit",5,27,53,"05/01/1867","","Daughter of 39"]
[40,522,"White","Sarah Anne","",5,27,25,"","",""]
[41,523,"White","John","73 Fahan St",5,27,68,"12/11/1881","Tobacconist","Husband of 39"]
[42,524,"Canning","Anthony","Black-Bush",5,28,86,"19/03/1852","","Formerly of Letterkenny"]
[43,525,"Doherty","Harriet","",5,29,59,"11/05/1834","","Erected by Daniel Doherty son"]
[44,526,"Doherty","May","",5,29,27,"29/09/1836","","Daughter to 43"]
[45,527,"Doherty","Winifred","21 Howard St",5,29,33,"10/10/1892","","Wife of Daniel Doherty"]
[46,528,"Doherty","Edward","124 St Columb's Wells",5,29,null,"05/03/1893","","Father to Daniel Doherty"]
[47,529,"McEwan","Harriet","20 Limewood St",5,29,null,"16/07/1943","","Wife to A Mc Ewan 20 Limewood St"]
[48,530,"O'Doherty","John","9 Princes St",5,30,72,"08/07/1883","","Husband of No 49"]
[49,531,"O'Doherty","Ellen","No Obit",5,30,54,"12/01/1860","",""]
[50,532,"O'Doherty","Joseph","Castlederg",5,30,49,"18/11/1882","Catholic Curate","Ordained 21/05/1861(Urney)"]
[51,533,"O'Doherty","Philip","P.P.",5,30,null,"25/02/1897","Monsignor","Born 1851,Ordained 1st July 1877."]
[52,534,"Gallagher","Patrick","No Obit",5,31,68,"08/12/1857","",""]
[53,535,"Gallagher","Anne","No Obit",5,31,55,"20/12/1849","",""]
[55,536,"Webb","Ellen","No Obit",5,32,26,"12/05/1879","",""]
[56,537,"Nelis","Jane","",5,8,17,"22/09/1850","","Daughter to No 10"]
[57,538,"Nelis","Elizabeth","No Obit",5,8,23,"24/02/1866","",""]
[58,539,"Coyle","Hugh","No Obit",5,33,24,"14/08/1880","",""]
[59,540,"Long","Patrick","No Obit",5,34,55,"29/01/1858","",""]
[60,541,"McDaid","Rosan","No Obit",5,35,null,"24/12/1863","",""]
[61,542,"McGilway","John","",5,36,38,"23/10/1850","",""]
[62,543,"Gallagher","John","No Obit",5,37,14,"20/01/1852","",""]
[63,544,"Roddy","John","",5,38,null,"","",""]
[64,545,"Mullholland","Stephen","",5,39,26,"30/03/1850","",""]
[65,546,"McElligott","Denis","No Obit",5,40,50,"01/04/1849","Qr Mr Sergt","Born in O'Dorney Co.Kerry."]
[66,547,"Conway","Thomas","",5,41,50,"","","Died 27th June"]
[67,548,"McMonagle","David","No Obit",5,42,18,"25/02/1847","","Erected by his father Patrick"]
[68,549,"Mills","Mary","Bishop St Without",5,0,0,"16/09/1845","","Wife of John Mills"]
[71,550,"Harkin","John","",5,0,65,"01/11/1851","",""]

{"sheet":"Aras_DB","index":1,"n_rows":552,"n_cols":12,"rows_kept":552,"cut":false,"hidden":false,"merged":[[0,0,0,11]]}
[]
["ID","ID_old","Surname","Forename","Address","Age","Date of Death","Occupation","Graveyard Number","Grave Yard Location","Grave Number","Any Other Comments"]
[1,5,"Mc Devitt","Patrick","14 Waterloo Street",68,"04/07/1875","",0,{"$f":"VLOOKUP(I3,Graveyards,2,2)","v":"Unknown"},null,""]
[2,6,"Quigley","Phillip","Abercorn Road",77,"19/12/1883","",0,"Unknown",null,""]
[3,7,"McClafferty","Mary","21 Abbey Street",null,"18/12/1883","",0,"Unknown",null,""]
[4,8,"Doherty","Winnifred","21 Howard Street",33,"09/10/1892","",0,"Unknown",null,"Mothers Address.Husband Daniel Doherty,Mason"]
[5,2,"Mc Donnell","Sarah","10 Linenhall St",5,"15/10/1892","",0,"Unknown",null,"Daughter of William Mc Donnell"]
[6,1,"Nugent","Ellen","47 Creggan Street",0,"13/10/1892","",0,"Unknown",null,"Uncles Residence."]
[7,9,"Cuthbert","Wliiam","Ferryquay Street",null,"05/10/1892","",0,"Unknown",null," At Brothers Residence."]
[8,10,"Quigley","Joseph","30 Ivy Terrace",19,"30/10/1892","",0,"Unknown",null,"Son of Phillip"]
[9,11,"Friel","Patrick","London Street",null,"13/08/1892","Merchant of City",0,"Unknown",null,""]
[10,12,"Gallagher","Susan","Ballymacarry,Parks",0,"","",0,"Unknown",null,"Buncrana,"]
[11,13,"Concannon","Richard","45 WellingtonSt",null,"18/07/1892","",0,"Unknown",null,""]
[12,14,"Mc Keever","John","3 Little Diamond",0,"02/07/1902","",0,"Unknown",null,"Son of Patrick Mc Keever"]
[13,15,"Doherty","Bridget","116 Bishop Street",16,"19/03/1896","",0,"Unknown",null,"Youngest Daughter of John Doherty Baker."]
[14,16,"Conaghan","Margaret","Linenhall Street",null,"12/02/1896","",0,"Unknown",null,"At Mary Margt Harts Residence Linenhall Street"]
[15,17,"Havlin","Catherine","87 St Columbs Wells",48,"13/03/1896","",0,"Unknown",null,"Relict of the late Edward"]
[16,18,"Lynch","Edward","42 William  Street",65,"26/05/1879","",0,"Unknown",null,""]
[17,19,"McGettigan","Mary Anne","Ballyougry",34,"24/05/1879","",0,"Unknown",null,"Wife of Neal McGettigan"]
[18,20,"Doherty","Ellen","Racecourse",null,"15/06/1879","",0,"Unknown",null,"Only Daughter of the late John Doherty"]
[19,21,"Deehan","Mary","75 Rossville Street",38,"02/06/1879","",0,"Unknown",null,"Wife of John Deehan Compositor"]
[20,22,"Craig","Anne","Glassaugh",70,"15/01/1879","",0,"Unknown",null,"Nee Carolau,wife to George,sister of Thomas."]
[21,23,"McLaughlin","Joseph","66 Rossville Street",63,"08/01/1869","",0,"Unknown",null,""]
[22,24,"Keys","Ellen","",0,"","",0,"Unknown",null,""]
[23,0,"Mc Daid","Patrick","16 Creggan Street",0,"17/09/1903","Senior Butcher",0,"Unknown",null,""]
[24,26,"Gallagher","Richard","Marlborough Tce",0,"03/09/1907","H.M. Customs.",0,"Unknown",null,""]
[25,27,"McDonnell","William","10 Linenhall Street",0,"29/07/1907","",0,"Unknown",null,""]
[26,28,"Doherty","Margaret","Racecourse",0,"31/01/1874","",0,"Unknown",null,"Wife of John Doherty"]
[27,29,"Collins","Mary","10 William Street",null,"10/01/1900","",0,"Unknown",null,"Daughter of late William Collins"]
[28,30,"Mc Daid","James","39 Bishop Street",0,"30/10/1896","Butcher",0,"Unknown",null,""]
[29,31,"Mc Ginley","Lizzie","126 Bogside",0,"24/04/1894","",0,"Unknown",null,"Second daughter of Michael Mc Ginley Builder."]
[30,3,"Macdevette","James","62 William Street",70,"14/04/1873","",0,"Unknown",null,""]
[31,4,"McLaughlin","Margaret","Ferguson Street",38,"19/03/1873","",0,"Unknown",null,"Daughter of the late Andrew Mc Laughlin"]
[32,1,"Mehan","James","",19,"12/02/1851","",1,"North Door Graveyard",1,""]
[33,2,"Mehan","Joseph","",2,"15/12/1832","",1,"North Door Graveyard",1,""]
[34,3,"Mehan","William","",3,"","",1,"North Door Graveyard",1,""]
[35,4,"Mehan","Joseph","",14,"01/01/1846","",1,"North Door Graveyard",1,""]
[36,5,"Kelly","Cornelius","",51,"22/03/1833","R.N. Surgeon",1,"North Door Graveyard",2,""]
[37,6,"Kelly","Thomas Patrick","",1,"24/06/1823","",1,"North Door Graveyard",2,"Son of No 5"]
[38,7,"Mc Daid","James","",null,"","",1,"North Door Graveyard",3,""]
[39,8,"Mc Daid","Ellen","",null,"10/10/1897","",1,"North Door Graveyard",3,"Wife of No 7"]
[40,9,"Mc Daid","Richard","",null,"29/04/1916","",1,"North Door Graveyard",3,"Son of No's 7 and 8"]
[41,10,"O'Scally","John","",68,"11/06/1824","Captain",1,"North Door Graveyard",4,""]
[42,11,"Mc Feely","Ann","",25,"06/06/1833","",1,"North Door Graveyard",4,"Daughter of No 10"]
[43,12,"Mc Feely","John","Foyle St",28,"24/09/1860","",1,"North Door Graveyard",4,"Son of No 11"]
[44,13,"Devlin","Robert","",34,"13/02/1840","",1,"North Door Graveyard",5,""]
[45,14,"Devlin","William","",null,"","",1,"North Door Graveyard",5,"Son of No 13"]
[46,15,"Devlin","James","",null,"","",1,"North Door Graveyard",5,"Son of No 13"]
[47,16,"Devlin","Maria","",null,"","",1,"North Door Graveyard",5,"Daughter of No 13"]
[48,17,"Casey","Hugh","",51,"02/07/1838","",1,"North Door Graveyard",6,""]
[49,18,"Casey","Margaret","",21,"19/11/1843","",1,"North Door Graveyard",6," Daughter of No 17"]
[50,19,"Doherty","Margaret","",80,"12/09/1859","",1,"North Door Graveyard",6,"Mother-in-Law to No 17"]
[51,20,"Collins","Anthony","",51,"16/11/1837","",1,"North Door Graveyard",7,""]
[52,21,"Collins","Sarah","",62,"05/05/1844","",1,"North Door Graveyard",7,"Wife of No 20"]
[53,22,"Collins","Anthony","",36,"02/12/1852","",1,"North Door Graveyard",7,"Son of 20 and 21"]
[54,23,"Collins","Ann","",17,"21/05/1858","",1,"North Door Graveyard",7,"Grand-daughter of 20 and 21"]
[55,24,"Collins","William","",73,"11/10/1880","",1,"North Door Graveyard",7,""]
[56,25,"Collins","Rose","10 Wiliiam Street",72,"05/10/1885","",1,"North Door Graveyard",7,"Wife of No 24"]
[57,26,"Collins","Catherine","10 William Street",36,"23/05/1886","",1,"North Door Graveyard",7,"Daughter of No 24 and 25"]
[58,27,"Collins","Mary","",42,"10/01/1901","",1,"North Door Graveyard",7,"."]
[59,28,"Collins","Anthony","",null,"28/12/1921","",1,"North Door Graveyard",7,""]
[60,29,"Mooney","Margaret","",33,"","",1,"North Door Graveyard",8,""]
[61,30,"Mooney","Ann","",42,"","",1,"North Door Graveyard",8,""]
[62,31,"Mooney","Joseph","",52,"05/02/1852","",1,"North Door Graveyard",8,""]
[63,32,"White","Mary Jane","",27,"16/04/1853","",1,"North Door Graveyard",8,"Daughter of Thomas White"]
[64,33,"Mooney","Jane","",50,"12/07/1848","",1,"North Door Graveyard",8,""]
[65,34,"Mooney","Rosa","20 Gt James Street",76,"02/02/1860","",1,{"$f":"VLOOKUP(I67,Graveyards,2,2)","v":"North Door Graveyard"},8,""]
[66,35,"Hassan","Elizabeth","",74,"16/02/1870","",1,"North Door Graveyard",8,"Servant to Mooneys 50 yrs"]
[67,36,"Mooney","John","",64,"02/04/1813","",1,"North Door Graveyard",8,""]
[68,37,"Mooney","Anne","",74,"16/06/1827","",1,"North Door Graveyard",8,"Wife of No 36"]
[69,38,"Murray","Thomas","",null,"","",1,"North Door Graveyard",9,"Burying Ground Only"]
[70,39,"Nugent","John","",46,"07/03/1848","",1,"North Door Graveyard",10,""]
[71,40,"Brown","Mary Ann","",25,"05/03/1850","",1,"North Door Graveyard",10,"Daughter of No 39"]
[72,41,"Brown","John","",1,"17/06/1849","",1,"North Door Graveyard",10,"Son of No 40"]
[73,42,"Nugent","Mary","5 Foyle St.",78,"20/05/1877","",1,"North Door Graveyard",10,"Wife of No 39"]
[74,43,"Mc Laughlin","Maggie G","",26,"05/03/1884","",1,"North Door Graveyard",10,"Granddaughter of No 39"]
[75,44,"Mc Laughlin","Ellen Nugent","",76,"24/11/1905","",1,"North Door Graveyard",10,"Daughter of No 39"]
[76,45,"Casey","Phillip","",84,"14/09/1832","",1,"North Door Graveyard",11,""]
[77,46,"Casey","Cecilia","",79,"23/03/1843","",1,"North Door Graveyard",11,"Wife of No 45"]
[78,47,"Fleming","Charles","Castle Street",71,"07/01/1890","",1,"North Door Graveyard",12,""]
[79,48,"O'Donnell","Thomas","Foyle Road",87,"27/07/1861","",1,"North Door Graveyard",13,""]
[80,49,"O'Donnell","Esther","Foyle Road",74,"21/10/1868","",1,"North Door Graveyard",13,"Wife of No 48"]
[81,50,"O'Donnell","William","Foyle Road",72,"21/02/1909","",1,"North Door Graveyard",13,"Son of No,s 48 and 49"]
[82,51,"O'Donnell","Mary","Foyle Road",null,"06/03/1879","",1,"North Door Graveyard",13,"Daughter of No,s 48 and 49"]
[83,52,"O.Donnell","Thomas","Foyle Road",null,"28/02/1898","",1,"North Door Graveyard",13,"Son of No,s 48 and 49"]
[84,53,"O.Donnell","Esther","Foyle Road",null,"11/03/1909","",1,"North Door Graveyard",13,"Daughter of No,s 48 and 49"]
[85,54,"Mc Kinney","Ellen","",15,"07/07/1852","",1,"North Door Graveyard",14,""]
[86,55,"Doherty","Sarah","",null,"","",1,"North Door Graveyard",15,"Wife of William Doherty"]
[87,56,"Mc Feely","Bridget","",28,"19/11/1827","",1,"North Door Graveyard",16,""]
[88,57,"Mc Feely","Bryan","",53,"01/05/1850","",1,"North Door Graveyard",16,""]
[89,58,"Mc Feely","Ellen","",56,"19/11/1846","",1,"North Door Graveyard",16,""]
[90,59,"Mc Feely","Mary","Foyle Street",45,"04/11/1851","",1,"North Door Graveyard",16,""]
[91,60,"Mc Feely","Michael","",77,"29/06/1868","",1,"North Door Graveyard",16,""]
[92,61,"Mc Feely","Michael","Foyle St.",33,"18/06/1872","",1,"North Door Graveyard",16,"only Surviving Son of Late Michael Mc Feely"]
[93,62,"Keys","George","Creevagh",99,"15/11/1903","",1,"North Door Graveyard",17,"Uncle of Bp J K O'Doherty"]
[94,63,"Heaney","Bernard","",57,"19/02/1857","",1,"North Door Graveyard",18,""]
[95,64,"Heaney","Bridget","9 Henrietta St",72,"15/12/1862","",1,"North Door Graveyard",18,"Wife of No 63"]
[96,65,"Griffin","Mary Ann","",25,"13/11/1826","",1,"North Door Graveyard",19,"Wife of Michael Griffin"]
[97,66,"Mc Clean","Dr William","Butcher St Derry",23,"05/09/1833","",1,"North Door Graveyard",20,""]
[98,67,"Mc Clean","Charles","",12,"09/02/1842","",1,"North Door Graveyard",20,"Brother of No 66"]
[99,68,"Mc Clean","Patrick","",23,"17/02/1850","",1,"North Door Graveyard",20,"Brother of No 66"]
[100,69,"Mc Clean","Neal","Butcher St",34,"29/01/1851","",1,"North Door Graveyard",20,"Brother of No 66"]
[101,70,"Mc Clean","Neal Snr","Butcher St",73,"07/04/1851","",1,"North Door Graveyard",20,"Father of No,s 66,67,68,69"]
[102,71,"Doherty","Margaret","",70,"10/12/1920","",1,"North Door Graveyard",21,""]
[103,72,"Doherty","Daniel","",null,"14/12/1914","",1,"North Door Graveyard",21,"Husband of No 71"]
[104,73,"Gill","Ann","",60,"","",1,"North Door Graveyard",null,""]
[105,74,"Mc Cafferty","Andrew","Woodlands, Fahan",69,"16/05/1888","",1,"North Door Graveyard",22,""]
[106,75,"Mc Cafferty","Margaret","",79,"18/03/1894","",1,"North Door Graveyard",22,"Wife of No 74"]
[107,76,"Mc Cafferty","Margaret","Victoria Place",29,"11/10/1873","",1,"North Door Graveyard",22,"Daughter of Andrew, Victoria Place"]
[108,77,"Mc Cafferty","Daniel","",null,"17/06/1885","",1,"North Door Graveyard",22,""]
[109,78,"Mc Cafferty","Andrew","",null,"","",1,"North Door Graveyard",22,"Died in Infancy"]
[110,79,"Mc Cafferty","James","",null,"","",1,"North Door Graveyard",22,"Died in Infancy"]
[111,80,"Mc Cafferty","Annie","",null,"","",1,"North Door Graveyard",22,"Died in Infancy"]
[112,81,"Mc Cafferty","Joseph","No Record",null,"20/11/1885","",1,"North Door Graveyard",22,""]
[113,82,"Mc Cafferty","Mary","Woodlands, Fahan.",null,"25/10/1896","",1,"North Door Graveyard",22,""]
[114,83,"Mc Cafferty","Andrew","18 Clooney terrace",43,"26/02/1893","Solicitor",1,"North Door Graveyard",22,"Interred in City Cemetery"]
[115,84,"Henry","Henry","",null,"","",1,"North Door Graveyard",22,"Grandparents"]
[116,85,"Henry","Mary","",null,"","",1,"North Door Graveyard",22,"to above"]
[117,86,"O'Doherty","Edward","Formerly of Molenan, Died at Whitehouse.",84,"09/05/1872","",1,"North Door Graveyard",23,"Father of Bp J K O'Doherty"]
[118,87,"O'Doherty","Margaret","",66,"13/09/1869","",1,"North Door Graveyard",23,"Mother of Bp J K O'Doherty"]
[119,88,"O'Doherty","Margaret Sarah","Molenan",34,"07/04/1860","",1,"North Door Graveyard",23,"Sister of Bp John Keys O'Doherty"]
[120,89,"Gillespie","James","",84,"27/01/1874","",1,"North Door Graveyard",24,""]
[121,90,"Gillespie","Margaret","85 Bishop St",78,"27/09/1878","",1,"North Door Graveyard",24,"Wife of Late James"]
[122,91,"Gillespie","Alice","",null,"","",1,"North Door Graveyard",24,"Daughter of No,s 89 and 90"]
[123,92,"Gillespie","Sarah","",null,"","",1,"North Door Graveyard",24,"Daughter of No,s 89 and 90"]
[124,93,"Gillespie","Ellen","",null,"","",1,"North Door Graveyard",24,"Daughter of No,s 89 and 90"]
[125,94,"Gillespie","Francis","",null,"","",1,"North Door Graveyard",24,"Daughter of No,s 89 and 90"]
[126,95,"Gillespie","James","",null,"","",1,"North Door Graveyard",24,"Son of No,s 89 and 90"]
[127,96,"Gillespie","Lawrence","",null,"","",1,"North Door Graveyard",24,"Son of No,s 89 and 90"]
[128,97,"Gillespie","John","",null,"","",1,"North Door Graveyard",24,"Son of No,s 89 and 90"]
[129,98,"Gillespie","Alicia","",null,"","",1,{"$f":"VLOOKUP(I131,Graveyards,2,2)","v":"North Door Graveyard"},24,"Daughter of No,s 89 and 90"]
[130,99,"Gillespie","Isabella","",null,"","",1,"North Door Graveyard",24,"Daughter of No,s 89 and 90"]
[131,100,"Gillespie","Margaret","",null,"","",1,"North Door Graveyard",24,"Daughter of No,s 89 and 90"]
[132,101,"Mc Laughlin","Andrew","",85,"03/03/1871","",1,"North Door Graveyard",25,""]
[133,102,"Mc Laughlin","Winifred","Ferguson Street",75,"20/04/1870","",1,"North Door Graveyard",25,"Wife of No 101"]
[134,103,"Mc Laughlin","Michael","",null,"","",1,"North Door Graveyard",25,"Son of 101 and 102"]
[135,104,"Mc Laughlin","Ellen","",null,"","",1,"North Door Graveyard",25,"Daughter of 101 and 102"]
[136,105,"Mc Laughlin","Patrick","",null,"","",1,"North Door Graveyard",25,"Son of 101 and 102"]
[137,106,"Mc Laughlin","Mary","",null,"","",1,"North Door Graveyard",25,"Daughter of 101 and 102"]
[138,107,"Mc Laughlin","Winifred","",null,"","",1,"North Door Graveyard",25,"Daughter of 101 and 102"]
[139,108,"Mc Laughlin","Margaret","",null,"","",1,"North Door Graveyard",25,"Daughter of 101 and 102"]
[140,109,"Mc Laughlin","Michael","",66,"16/04/1907","",1,"North Door Graveyard",25,"Son 101 and 102"]
[141,110,"Mc Laughlin","Phillip","No Obit",68,"11/08/1899","Surveyor/Architect",1,"North Door Graveyard",26,""]
[142,111,"Mc Laughlin","David","",null,"","",1,"North Door Graveyard",26,"Father of No 110"]
[143,112,"Mc Laughlin","Margaret","",null,"","",1,"North Door Graveyard",26,"Mother of No 110"]
[144,113,"Mc Monagle","Henry","",null,"","",1,"North Door Graveyard",26,""]
[145,114,"McMonagle","Hannah C","",null,"","",1,"North Door Graveyard",26,"Nee-Mc Laughlin"]
[146,115,"Mc Monagle","Annie","",null,"01/04/1936","",1,"North Door Graveyard",26,""]
[147,116,"Mc Monagle","Daniel mc Laughlin","",null,"","",1,"North Door Graveyard",27,""]
[148,117,"Hart","William","",52,"27/10/1848","",1,"North Door Graveyard",28,""]
[149,118,"Hart","Mary","",13,"10/11/1840","",1,"North Door Graveyard",28,""]
[150,119,"Quigley","Edward","",null,"","",1,"North Door Graveyard",29,""]
[151,120,"Quigley","John","",null,"","",1,"North Door Graveyard",29,""]
[152,121,"Quigley","Joseph","",null,"","",1,"North Door Graveyard",29,""]
[153,122,"Quigley","William James","",23,"10/04/1899","",1,"North Door Graveyard",29,""]
[154,123,"Quigley","Phillip","",72,"03/05/1904","",1,"North Door Graveyard",29,"Father of No 119 to 122"]
[155,124,"Quigley","Bridget","",null,"12/03/1914","",1,"North Door Graveyard",29,"Mother of No 119 to 122"]
[156,125,"Devlin","Mary","",72,"29/09/1843","",1,"North Door Graveyard",30,""]
[157,126,"Devlin","John","14 Abercorn Road",null,"29/04/1894","",1,"North Door Graveyard",30,""]
[158,127,"Devlin","Kate","Nazareth House, Derry.",null,"18/07/1899","",1,"North Door Graveyard",30,"Daughter of Late Jphn Devlin, Waterside, Merchant."]
[159,128,"Devlin","Mary","Nazareth House, Derry.",null,"05/07/1900","",1,"North Door Graveyard",30,"Daughter of Late John Devlin, Waterside."]
[160,129,"Mc Collum","John","",23,"18/04/1948","",1,"North Door Graveyard",31,""]
[161,130,"Mc Collum","Bernard","Rossville St",35,"22/10/1867","",1,"North Door Graveyard",31,""]
[162,131,"Mc Collum","Margaret","",null,"","",1,"North Door Graveyard",31,""]
[163,132,"Doherty","Denis","",null,"14/10/1848","",1,"North Door Graveyard",32,""]
[164,133,"Doherty","Charity","Shipquay St",null,"17/05/1864","",1,"North Door Graveyard",32,""]
[165,134,"Doherty","Catherine","Shipquay St",null,"03/10/1848","",1,"North Door Graveyard",32,""]
[166,135,"Doherty","George","",null,"20/07/1847","",1,"North Door Graveyard",32,""]
[167,136,"Doherty","Francis","",null,"11/01/1851","",1,"North Door Graveyard",32,""]
[168,137,"Doherty","Denis","",null,"","",1,"North Door Graveyard",32,""]
[169,138,"Doherty","Anny","",null,"","",1,"North Door Graveyard",32,""]
[170,139,"Doherty","Ellen","",null,"","",1,"North Door Graveyard",32,""]
[171,140,"Doherty","Mary Eliza","",null,"","",1,"North Door Graveyard",32,""]
[172,141,"Gallagher","Neal","",68,"","",1,"North Door Graveyard",33,""]
[173,142,"Stirke","Eliza","",28,"02/03/1843","",1,"North Door Graveyard",34,"Wife of Lieut Stirke 11th Regiment"]
[174,143,"Devlin","Michael","No Issue.",84,"04/11/1872","",1,"North Door Graveyard",35,""]
[175,144,"Devlin","Sarah","137 Bishop St Without",76,"20/04/1875","",1,"North Door Graveyard",35,"Wife of No 143"]
[176,145,"Devlin","Cornelius","137 Bishop St Without",43,"01/05/1874","",1,"North Door Graveyard",35,"Son of No,s 143 and 144."]
[177,146,"Devlin","Michael","",null,"12/02/1912","",1,"North Door Graveyard",35,"Son of No,s 143 and 144"]
[178,147,"Fallon","Eleanor","",null,"10/02/1926","",1,"North Door Graveyard",35,"Daughter of No,s 143 and 144."]
[179,148,"Mc Laughlin","Daniel","",null,"","",1,"North Door Graveyard",36,""]
[180,149,"Mc Laughlin","","",null,"","",1,"North Door Graveyard",36,""]
[181,150,"Mc Dermott","John","12 Waterloo St",58,"08/04/1872","",1,"North Door Graveyard",37,""]
[182,151,"Mc Dermott","Margery","",42,"25/12/1860","",1,"North Door Graveyard",37,""]
[183,152,"Mc Dermott","Henry","",null,"","",1,"North Door Graveyard",37,"Son of No,s 150 and 151"]
[184,153,"Mc Dermott","Mary-Ann","",null,"","",1,"North Door Graveyard",37,"Daughter of No,s 150 and 151"]
[185,154,"Mc Dermott","Margery","",null,"","",1,"North Door Graveyard",37,"Daughter of No,s 150 and 151"]
[186,155,"Mc Dermott","Joseph","",null,"","",1,"North Door Graveyard",37,"Son of No,s 150 and 151"]
[187,156,"Mc Dermott","Edward","",null,"","",1,"North Door Graveyard",37,"Son of No,s 150 and 151"]
[188,157,"Mc Dermott","Elizabeth","",null,"","",1,"North Door Graveyard",37,"Daughter of No,s 150 and 151"]
[189,158,"Mc Dermott","Margaret","",null,"","",1,"North Door Graveyard",37,"First Wife of No 150"]
[190,159,"Campbell","Bernard","",72,"12/02/1842","",1,"North Door Graveyard",38,""]
[191,160,"Campbell","Mary","",84,"24/08/1848","",1,"North Door Graveyard",38,"Wife of No 159"]
[192,161,"Campbell","Mary","",1,"","",1,"North Door Graveyard",38,"Grandchild of 159 and 160"]
[193,162,"Campbell","George","",9,"13/03/1849","",1,{"$f":"VLOOKUP(I195,Graveyards,2,2)","v":"North Door Graveyard"},38,"Grandchild of 159 and 160"]
[194,163,"Campbell","Patrick","Fountain St",61,"17/07/1866","",1,"North Door Graveyard",38,"Son of No,s 159 and 160"]
[195,164,"Campbell","James","",69,"17/02/1871","",1,"North Door Graveyard",38,"Son of No,s 159 and 160"]
[196,165,"Campbell","Mary","??????????????check John  Fountain St.",40,"28/10/1878","",1,"North Door Graveyard",38,"Wife of No 164"]
[197,166,"Bradley","Patrick","",82,"22/03/1836","",1,"North Door Graveyard",39,""]
[198,167,"Bradley","Susannah","",72,"07/02/1835","",1,"North Door Graveyard",39,"Wife of No 166"]
[199,168,"Bradley","Anne","",37,"04/03/1835","",1,"North Door Graveyard",39,"Daughter of No,s 166 and 167"]
[200,169,"Bradley","Susannah","",59,"19/07/1851","",1,"North Door Graveyard",39,"Daughter of No,s 166 and 167"]
[201,170,"Bradley","James","",37,"29/07/1832","",1,"North Door Graveyard",39,"Son of No,s 166 and 167"]
[202,171,"Bradley","Ann","",38,"19/06/1841","",1,"North Door Graveyard",39,"Wife of No 170"]
[203,172,"Bradley","Ann","",null,"","",1,"North Door Graveyard",39,"Daughter of No,s 170 and 171"]
[204,173,"Bradley","Patrick","",null,"","",1,"North Door Graveyard",39,"Son of No,s 170and 171"]
[205,174,"Bradley","Daniel","",null,"","",1,"North Door Graveyard",39,"Son of No,s 170 and 171"]
[206,175,"Bradley","James","",null,"","",1,"North Door Graveyard",39,"Son of No,s 170 and 171"]
[207,176,"Bradley","Catherine","",null,"","",1,"North Door Graveyard",39,"Daughter of No,s 170 and 171"]
[208,177,"Bradley","Anne","Society St",32,"09/10/1851","",1,"North Door Graveyard",39,"Wife of Patrick Bradley of city"]
[209,178,"Bradley","Ann","",2,"16/12/1848","",1,"North Door Graveyard",39,"Daughter of No 177"]
[210,179,"Bradley","Mary Elizabeth","",3,"14/03/1853","",1,"North Door Graveyard",39,"Daughter of No 177"]
[211,180,"Bradley","Ellen","",19,"14/01/1865","",1,"North Door Graveyard",39,"Daughter of No 177"]
[212,181,"Bradley","Susan D M","Sunnyside",19,"31/01/1867","",1,"North Door Graveyard",39,"Daughter of No 177"]
[213,182,"Bradley","Patrick","",83,"23/07/1884","",1,"North Door Graveyard",39,""]
[214,183,"Mc Bride","Catherine","East Wall",40,"12/07/1866","",1,"North Door Graveyard",40,""]
[215,184,"Mc Bride","James","",null,"","",1,"North Door Graveyard",40,"Son of No,s 183 and 190"]
[216,185,"Mc Bride","Harriet","",null,"","",1,"North Door Graveyard",40,"Daughter of No,s 183 and 190"]
[217,186,"Mc Bride","Sarah","",null,"","",1,"North Door Graveyard",40,"Daughter of No,s 183 and 190"]
[218,187,"Mc Bride","Elizabeth","",null,"","",1,"North Door Graveyard",40,"Daughter of No,s 183 and 190"]
[219,188,"Mc Bride","William","",7,"","",1,"North Door Graveyard",40,""]
[220,189,"Mc Bride","James","",null,"08/01/1875","",1,"North Door Graveyard",40,"Husband of No 183"]
[221,190,"McNulty","James","",null,"","",1,"North Door Graveyard",40,"Grand-Son of No,s 183 and 189"]
[222,191,"Mc Nulty","Mary","",null,"","",1,"North Door Graveyard",40,"Grand-Daughter of No,s 183 and 190"]
[223,192,"Mc Bride","Charles","Glenview House Edenballymore",30,"02/04/1886","",1,"North Door Graveyard",40,"Son of No,s 183 and 190"]
[224,193,"Kearney","Daniel","",76,"11/05/1850","",1,"North Door Graveyard",41,""]
[225,194,"Kearney","Daniel","William St",null,"11/09/1860","Lessee Brdg Tolls",1,"North Door Graveyard",41,"Husband of No 193"]
[226,195,"Kearney","Grace","William St",86,"12/01/1863","",1,"North Door Graveyard",41,"Wife of No 193"]
[227,196,"Carson","John","",3,"23/12/1842","",1,"North Door Graveyard",41,""]
[228,197,"Mc Elheran","","",null,"","",1,"North Door Graveyard",42,""]
[229,198,"Murphy","John","",null,"","",1,"North Door Graveyard",43,""]
[230,199,"Shields","D","",null,"","",1,"North Door Graveyard",44,""]
[231,200,"Mc Sheffrey","Charles","",66,"","",1,"North Door Graveyard",45,""]
[232,201,"Mc Keown","Hugh","",80,"06/06/1868","",1,"North Door Graveyard",46,""]
[233,202,"Mc Keown","Edward","",67,"15/05/1898","",1,"North Door Graveyard",46,""]
[234,203,"Mc Keown","Margaret","",62,"24/05/1898","",1,"North Door Graveyard",46,""]
[235,204,"Rogers","Sarah Josephine","33 Foyle St",55,"12/03/1874","",1,"North Door Graveyard",47,""]
[236,205,"Rogers","Mary Josephine","",19,"11/07/1873","",1,"North Door Graveyard",47,"Daughter of No 204 & Charles"]
[237,206,"Rogers","John Joseph","",1,"12/03/1852","",1,"North Door Graveyard",47,"Son of No 204"]
[238,207,"Ward","James","",24,"05/03/1833","",1,"North Door Graveyard",48,""]
[239,208,"Ward","William","",28,"20/01/1841","",1,"North Door Graveyard",48,""]
[240,209,"Ward","Sarah","",76,"12/05/1903","",1,"North Door Graveyard",48,""]
[241,210,"Ward","Mary","40 Rossville St",16,"05/01/1875","",1,"North Door Graveyard",48,"Daughter of Michael Ward."]
[242,211,"Ward","Sarah","",36,"03/04/1898","",1,"North Door Graveyard",48,""]
[243,212,"Ward","Michael","41 Elmwood Terrace",78,"23/03/1903","",1,"North Door Graveyard",48,""]
[244,213,"O'Donnell","Susan","",70,"02/03/1854","",1,"North Door Graveyard",49,""]
[245,214,"O'Donnell","Daniel","",32,"25/01/1850","",1,"North Door Graveyard",49,"maybe 1860 Son of 213"]
[246,215,"O'Donnell","John","",80,"17/03/1863","",1,"North Door Graveyard",49,"Husband of 213"]
[247,216,"O'Donnell","Catherine","Kildrum",31,"01/08/1870","",1,"North Door Graveyard",49,"Wife of 217"]
[248,217,"O'Donnell","John","",71,"16/03/1898","",1,"North Door Graveyard",49,"maybe 1899 Husband of 216"]
[249,218,"Gallagher","James","",63,"05/06/1813","",1,"North Door Graveyard",50,""]
[250,219,"Gallagher","Mary","",82,"05/04/1830","",1,"North Door Graveyard",50,""]
[251,220,"Gallagher","Patrick","",22,"08/01/1841","",1,"North Door Graveyard",50,""]
[252,221,"Gallagher","Edward","",72,"09/11/1871","",1,"North Door Graveyard",50,"son of 218 & 219 father of 220"]
[253,222,"Gallagher","Sarah","",73,"01/11/1866","",1,"North Door Graveyard",50,"wife of 221"]
[254,223,"Gallagher","Mary","No Death Notice",48,"15/01/1872","",1,"North Door Graveyard",50,"daughter of 220 & 221"]
[255,224,"Gallagher","Theresa","No Death Notice",73,"16/08/1905","",1,"North Door Graveyard",50,""]
[256,225,"Flanagan","John","No Death Notice",null,"21/04/1888","",1,"North Door Graveyard",51,""]
[257,226,"Hart","Anne","Linenhall St",44,"20/01/1871","",1,{"$f":"VLOOKUP(I259,Graveyards,2,2)","v":"North Door Graveyard"},52,"Erected by Philip Lynch"]
[258,227,"Doherty","Hugh","21 Creggan St",3,"23/03/1876","",1,"North Door Graveyard",53,"Father Michael"]
[259,228,"Doherty","Michael J","21 Creggan St",1,"27/03/1876","",1,"North Door Graveyard",53,"Father Michael"]
[260,229,"McBride","Catherine","",null,"12/07/1866","",1,"North Door Graveyard",54,""]
[261,230,"McBride","James","",null,"08/01/1875","",1,"North Door Graveyard",54,"Husband to 229"]
[262,231,"McBride","Charles","",30,"02/04/1886","",1,"North Door Graveyard",54,""]
[263,232,"Murray","John","",55,"10/04/1850","",1,"North Door Graveyard",55,""]
[264,233,"Murray","Maria","21 Francis St",72,"15/03/1874","",1,"North Door Graveyard",55,"Wife of John Murray."]
[265,234,"Kearney","Christian","",23,"10/11/1823","",1,"North Door Graveyard",56,""]
[266,235,"Brisland","John","",65,"21/11/1826","",1,"North Door Graveyard",57,""]
[267,236,"McDonough","Ellen","",null,"","",1,"North Door Graveyard",57,"Wife of 235"]
[268,237,"Doherty","Daniel","",null,"","",1,"North Door Graveyard",null,""]
[269,238,"McBride","Hannah","",80,"01/04/1869","",1,"North Door Graveyard",59,""]
[270,239,"McBride","Patrick","Richmond St.",80,"19/07/1872","",1,"North Door Graveyard",59,""]
[271,240,"Mehan","Rose","",21,"21/11/1836","",1,"North Door Graveyard",60,""]
[272,241,"McLoughlin","Marcus","Possible Bridget?",null,"12/05/1836","",1,"North Door Graveyard",61,""]
[273,242,"McLoughlin","John Casey","",null,"27/11/1843","",1,"North Door Graveyard",61,""]
[274,243,"Shearen","Catherine","",18,"17/03/1865","",1,"North Door Graveyard",62,""]
[275,244,"Sweney","James","",null,"","",1,"North Door Graveyard",63,"Burying ground"]
[276,245,"Murray","Denis","",71,"16/02/1833","",1,"North Door Graveyard",64,""]
[277,246,"Freeman","Catharine","",80,"04/03/1831","",1,"North Door Graveyard",65,""]
[278,247,"Rogers","Sarah Josephine","",55,"12/03/1874","",1,"North Door Graveyard",66,"Wife of Charles"]
[279,248,"Rogers","Mary Josephine","",19,"11/07/1873","",1,"North Door Graveyard",66,""]
[280,249,"Rogers","John Joseph","",1,"12/03/1852","",1,"North Door Graveyard",66,""]
[281,250,"O'Donnell","Edward","",null,"","",1,"North Door Graveyard",null,""]
[282,251,"O'Donnell","Sarah","",null,"","",1,"North Door Graveyard",null,""]
[283,252,"O'Donnell","Edward","",null,"","",1,"North Door Graveyard",null,"Son of 250 & 251"]
[284,253,"O'Donnell","Charles","",null,"","",1,"North Door Graveyard",null,"Son of 250 & 251"]
[285,254,"O'Donnell","Sarah","",null,"","",1,"North Door Graveyard",null,"Daughter of 250 & 251"]
[286,255,"Hart","Margaret","",46,"27/01/1829","",1,"North Door Graveyard",68,""]
[287,256,"Hart","John","",78,"12/11/1851","",1,"North Door Graveyard",68,""]
[288,257,"Hart","Mary","City Hotel",15,"25/09/1860","",1,"North Door Graveyard",69,""]
[289,258,"Hart","William","Linenhall St.Mate Foyle Steamer",52,"26/10/1848","River Pilot",1,"North Door Graveyard",70,"Between Liverpool and Derry"]
[290,259,"Mc Loughlin","William","Castle St",50,"03/01/1861","Doctor",1,"North Door Graveyard",71,""]
[291,260,"Murray","Dennis","",71,"16/02/1833","",1,"North Door Graveyard",72,""]
[292,261,"Sweney","James","",null,"","",1,"North Door Graveyard",73,""]
[293,262,"Shearen","Catherine","",18,"17/03/1865","",1,"North Door Graveyard",74,""]
[294,263,"Coyle","D","Harvey St",75,"09/09/1860","",1,"North Door Graveyard",0,"Grave Unknown"]
[295,264,"Mc Ginley","Sarah Anne","124 Long Bogside",0,"01/02/1867","",1,"North Door Graveyard",0,"Grave Unknown"]
[296,265,"Mc Closkey","John James","",20,"28/07/2008","",1,"North Door Graveyard",75,"Year still to be determined"]
[297,266,"Rowan","William","Artillery Lane",null,"04/03/1853","",1,"North Door Graveyard",76,""]
[298,267,"Rowan","Catherine","",17,"","",1,"North Door Graveyard",76,""]
[299,11,"Doherty","William","",48,"18/03/1848","",2,"Long Tower Girls School Graveyard",8,""]
[300,12,"Doherty","William","No Obit",30,"24/09/1870","",2,"Long Tower Girls School Graveyard",9,""]
[301,13,"Rogers","Edward","",36,"03/07/1850","",2,"Long Tower Girls School Graveyard",10,""]
[302,14,"Doherty","Elizabeth","No Obit",0,"14/07/1864","",2,"Long Tower Girls School Graveyard",11,""]
[303,15,"McCormick","John","",64,"","",2,"Long Tower Girls School Graveyard",12,""]
[304,16,"McCormick","Bridget","",null,"","",2,"Long Tower Girls School Graveyard",12,""]
[305,17,"Coyle","James","",32,"26/12/1817","",2,"Long Tower Girls School Graveyard",13,""]
[306,18,"Bradley","Peter","No Obit",60,"12/02/1866","",2,"Long Tower Girls School Graveyard",14,""]
[307,19,"Fox","Ann","",null,"","",2,"Long Tower Girls School Graveyard",15,""]
[308,20,"Fox","Thomas","",null,"01/01/1820","",2,"Long Tower Girls School Graveyard",15,"Day and month inaccurate"]
[309,21,"Campbell","Mary","No Obit",36,"12/01/1849","",2,"Long Tower Girls School Graveyard",16,""]
[310,22,"McCool","James","No Obit",null,"18/10/1870","",2,"Long Tower Girls School Graveyard",17,""]
[311,23,"Brogan","Elenor","",48,"08/03/1867","",2,"Long Tower Girls School Graveyard",18,""]
[312,24,"Brogan","Margaret","",18,"08/03/1867","",2,"Long Tower Girls School Graveyard",18,""]
[313,25,"Deerin","Sarah","",16,"17/05/1852","",2,"Long Tower Girls School Graveyard",19,""]
[314,26,"Carlin","John","Braehead",67,"02/09/1892","",2,"Long Tower Girls School Graveyard",20,""]
[315,27,"Carlin","Thomas","Glashaugh",85,"02/11/1894","",2,"Long Tower Girls School Graveyard",20,""]
[316,28,"Reid","John","",46,"28/01/1857","",2,"Long Tower Girls School Graveyard",21,""]
[317,29,"Ferguson","Cecilia","",14,"22/07/1874","",2,"Long Tower Girls School Graveyard",21,""]
[318,30,"Reid","Ellen","",34,"27/04/1877","",2,"Long Tower Girls School Graveyard",21,""]
[319,31,"Mullen","Rose","Cowbog Street",16,"04/10/1861","",2,"Long Tower Girls School Graveyard",22,"2nd Daughter of Alex Mullen"]
[320,32,"Mullen","Alexander","Waterloo St",48,"30/10/1863","Whitesmith",2,"Long Tower Girls School Graveyard",22,""]
[321,33,"Mullen","Mary Therese","",17,"","",2,{"$f":"VLOOKUP(I323,Graveyards,2,2)","v":"Long Tower Girls School Graveyard"},22,"Refer to book"]
[322,34,"Dougan","Owen","",50,"15/04/1821","",2,"Long Tower Girls School Graveyard",23,""]
[323,35,"Dougan","Michael","",22,"22/10/1840","",2,"Long Tower Girls School Graveyard",23,""]
[324,36,"Bell","M","",null,"","",2,"Long Tower Girls School Graveyard",24,""]
[325,37,"Bell","Anne","",null,"","",2,"Long Tower Girls School Graveyard",24,""]
[326,38,"Bell","John","",null,"","",2,"Long Tower Girls School Graveyard",24,""]
[327,39,"Bell","Hugh","",null,"","",2,"Long Tower Girls School Graveyard",24,""]
[328,40,"Bell","Hugh","202 Bishop Street",null,"01/07/1937","",2,"Long Tower Girls School Graveyard",25,""]
[329,41,"Bell","Frances","",null,"02/01/1948","",2,"Long Tower Girls School Graveyard",25,""]
[330,42,"Doherty","John","",73,"21/02/1877","",2,"Long Tower Girls School Graveyard",26,""]
[331,43,"Doherty","Ann","",80,"04/02/1901","",2,"Long Tower Girls School Graveyard",26,""]
[332,44,"Doherty","Ann","",38,"08/03/1907","",2,"Long Tower Girls School Graveyard",26,"Daughter of 42 & 43"]
[333,45,"Hibbits","William","",78,"11/05/1825","",2,"Long Tower Girls School Graveyard",27,"Refer to book for obit"]
[334,46,"Bradley","Henry","Creggan Street",0,"","",2,"Long Tower Girls School Graveyard",28,""]
[335,47,"Bradley","Catherine","Creggan Street",0,"30/07/1931","",2,"Long Tower Girls School Graveyard",28,""]
[336,48,"Bradley","Jennie","",0,"13/12/1904","",2,"Long Tower Girls School Graveyard",28,""]
[337,49,"Bradley","Fannie","",0,"26/05/1914","",2,"Long Tower Girls School Graveyard",28,""]
[338,50,"Bradley","John","",0,"11/08/1915","",2,"Long Tower Girls School Graveyard",28,""]
[339,51,"Bradley","Cassie","",0,"27/02/1936","",2,"Long Tower Girls School Graveyard",28,""]
[340,52,"McCormick","John","",56,"02/12/1810","",2,"Long Tower Girls School Graveyard",29,""]
[341,53,"McCormick","Ann","",48,"27/08/1837","",2,"Long Tower Girls School Graveyard",29,""]
[342,54,"McCormick","Sophia","",2,"25/09/1818","",2,"Long Tower Girls School Graveyard",29,""]
[343,55,"Breslan","William","",18,"10/05/1872","",2,"Long Tower Girls School Graveyard",30,"Son of 56 & 57"]
[344,56,"Breslan","Catherine","15 Long Tower Street",null,"17/04/1892","",2,"Long Tower Girls School Graveyard",30,""]
[345,57,"Breslan","James","",null,"21/03/1900","",2,"Long Tower Girls School Graveyard",31,""]
[346,58,"O'Hagan","William","21 Orchard St",null,"02/11/1889","",2,"Long Tower Girls School Graveyard",31,"late of Creevagh"]
[347,59,"O'Hagan","Margaret","Creevagh",null,"","",2,"Long Tower Girls School Graveyard",31,""]
[348,60,"O'Hagan","Bernard","Creevagh",null,"","",2,"Long Tower Girls School Graveyard",31,""]
[349,61,"O'Hagan","Annie","Creevagh",null,"","",2,"Long Tower Girls School Graveyard",31,""]
[350,62,"O'Hagan","Ellen","Creevagh",null,"","",2,"Long Tower Girls School Graveyard",31,""]
[351,63,"O'Hagan","James","Creevagh",null,"","",2,"Long Tower Girls School Graveyard",31,""]
[352,64,"O'Hagan","Rebecca","Creevagh",null,"","",2,"Long Tower Girls School Graveyard",31,""]
[353,74,"Smith","Bridget","",49,"04/02/1859","",2,"Long Tower Girls School Graveyard",4,""]
[354,75,"Smith","Michael","",44,"12/01/1852","",2,"Long Tower Girls School Graveyard",4,""]
[355,1,"Mc Connelogue","Ann","",48,"23/03/1825","",2,"Long Tower Girls School Graveyard",1,""]
[356,2,"O'Gorman","Catherine","",null,"04/12/1858","",2,"Long Tower Girls School Graveyard",2,""]
[357,3,"O'Gorman","Metthew","",32,"11/02/1816","",2,"Long Tower Girls School Graveyard",2,""]
[358,4,"Halferty","Rose","",0,"","",2,"Long Tower Girls School Graveyard",3,""]
[359,5,"Smith","John","",32,"11/02/1816","",2,"Long Tower Girls School Graveyard",4,""]
[360,6,"Mc Laughlin","Elanor","No Obit",2,"06/12/1845","",2,"Long Tower Girls School Graveyard",5,""]
[361,7,"Mc Laughlin","John","No Obit",63,"22/06/1854","",2,"Long Tower Girls School Graveyard",6,""]
[362,8,"Logue","Patrick","",null,"","",2,"Long Tower Girls School Graveyard",7,""]
[363,9,"Logue","Mary","",null,"","",2,"Long Tower Girls School Graveyard",7,""]
[364,10,"Logue","Charles Hugh","",null,"","",2,"Long Tower Girls School Graveyard",7,""]
[365,65,"Kate","Toye","Myrtle Villa Northland Rd",null,"15/04/1912","Wife of E.J.Toye Architect",2,"Long Tower Girls School Graveyard",31,"Late of Creevagh"]
[366,66,"Concannon","John","56 Deanery St",72,"19/03/1941","",2,"Long Tower Girls School Graveyard",32,""]
[367,67,"Concannon","Margaret","56 Deanery St",80,"02/02/1950","",2,"Long Tower Girls School Graveyard",30,""]
[368,68,"Doherty","Joseph","",null,"","",2,"Long Tower Girls School Graveyard",null,""]
[369,69,"Blaney","P O'Hagan","",0,"17/10/1907","Catholic Curate",2,"Long Tower Girls School Graveyard",31,"Died on Holiday in Dublin"]
[370,70,"Doherty","Mary Jane","Burnfoot Co Donegal",79,"02/09/1958","",2,"Long Tower Girls School Graveyard",32,""]
[371,71,"Brown","Jane","",50,"12/12/1862","",2,"Long Tower Girls School Graveyard",33,""]
[372,72,"Brown","William","",63,"13/06/1877","",2,"Long Tower Girls School Graveyard",33,""]
[373,73,"Durnin","P","",0,"","",2,"Long Tower Girls School Graveyard",0,""]
[374,1,"Gillespie","Jane","",63,"08/05/1834","",3,"Long Tower Boys School Graveyard ",1,"Might be March"]
[375,2,"Gillespie","Elleznor","",0,"","",3,"Long Tower Boys School Graveyard ",1,""]
[376,3,"Gillespie","Mary","",0,"","",3,"Long Tower Boys School Graveyard ",1,""]
[377,4,"Gillespie","Paul","",77,"01/02/1843","",3,"Long Tower Boys School Graveyard ",1,""]
[378,5,"Hannigan","Bryan","",63,"","",3,"Long Tower Boys School Graveyard ",2,"Born 1784 Died 1847"]
[379,6,"McLaughlin","Cornelius","Foyle Hill",0,"","",3,"Long Tower Boys School Graveyard ",3,""]
[380,7,"McLaughlin","James","Foyle Hill",0,"","",3,"Long Tower Boys School Graveyard ",3,""]
[381,8,"McLaughlin","Bridget","Foyle Hill",0,"","",3,"Long Tower Boys School Graveyard ",3,""]
[382,9,"Mulrine","Edward","",0,"","",3,"Long Tower Boys School Graveyard ",4,"Died 1816"]
[383,10,"O'Donnell","Bridget","",0,"","",3,"Long Tower Boys School Graveyard ",4,"Died 1817"]
[384,11,"Morrison","Susan","",0,"","",3,"Long Tower Boys School Graveyard ",4,"Died 1830"]
[385,12,"Watson","Catherine","",0,"","",3,{"$f":"VLOOKUP(I387,Graveyards,2,2)","v":"Long Tower Boys School Graveyard "},4,"Died 1843"]
[386,13,"Perry","Rebecca","",0,"","",3,"Long Tower Boys School Graveyard ",4,"Died 1844"]
[387,14,"Hutton","John","",0,"04/09/1952","",3,"Long Tower Boys School Graveyard ",5,"Ordained June 1933"]
[388,15,"O'Donnell","John","",62,"29/05/1852","",3,"Long Tower Boys School Graveyard ",6,""]
[389,16,"Hill","John","",0,"","",3,"Long Tower Boys School Graveyard ",7,""]
[390,17,"Hill","James","",0,"","",3,"Long Tower Boys School Graveyard ",7,""]
[391,18,"Hill","Bridget","",0,"","",3,"Long Tower Boys School Graveyard ",7,""]
[392,19,"Garland","James","",42,"10/05/1842","",3,"Long Tower Boys School Graveyard ",8,""]
[393,20,"Gallaugher","Salley","",32,"22/02/1839","",3,"Long Tower Boys School Graveyard ",9,""]
[394,21,"Mulhearn","Neal","",27,"18/01/1852","",3,"Long Tower Boys School Graveyard ",10,"Erected by his Mother,Margaret."]
[395,22,"Daly","Batheldes","",26,"24/06/1904","Nazareth Nun",3,"Long Tower Boys School Graveyard ",11,"Born 17/03/1878 at Benefrehan"]
[396,23,"Crowley","Mary","",52,"19/04/1910","Nazareth Nun",3,"Long Tower Boys School Graveyard ",11,"Born 03/05/1858 Farrenfore,Co Kerry"]
[397,24,"Loughrey","Mary Thecla","",39,"17/09/1904","Nazareth Nun",3,"Long Tower Boys School Graveyard ",11,"Born15/01/1865 Ballynacargy,Co Westmeath"]
[398,25,"Regan","Mary Ruperta","",53,"11/11/1925","Nazareth Nun",3,"Long Tower Boys School Graveyard ",11,"Born 09/06/1872 Desertmartin,Co Derry"]
[399,26,"Maguire","Mary Zita","",54,"25/05/1926","Nazareth Nun",3,"Long Tower Boys School Graveyard ",11,"Born 15/03/1872 Corodorona Co Cavan"]
[400,27,"Walsh","Mary Regis","",81,"20/11/1930","Nazareth Nun",3,"Long Tower Boys School Graveyard ",11,"Born 02/02/1849 Croom Co Limerick"]
[401,28,"Mulholland","Mary Modesta","",57,"18/03/1931","Nazareth Nun",3,"Long Tower Boys School Graveyard ",11,"Born 21/07/1873 Moneymore Co Derry"]
[402,29,"Curtain","John of Matha","",60,"04/07/1935","Nazareth Nun",3,"Long Tower Boys School Graveyard ",11,"Born 01/10/1874 Abbeyfeale Co Limerick"]
[403,30,"Dempsey","Theresa","",56,"28/05/1940","Nazareth Nun",3,"Long Tower Boys School Graveyard ",11,"Born 10/11/1883 Croagh Co Limerick"]
[404,31,"Collins","Mary Lucis","",59,"21/06/1940","Nazareth Nun",3,"Long Tower Boys School Graveyard ",11,"Born 31/03/1881 Ballynabrackey Co Meath."]
[405,32,"Mc Kenna","Mother St Eliz","",65,"21/08/1942","Nazareth Nun",3,"Long Tower Boys School Graveyard ",11,"Born 01/03/1877 Maghera Co Derry"]
[406,33,"Lynch","M Myron","",53,"30/01/1948","Nazareth Nun",3,"Long Tower Boys School Graveyard ",11,"Born 17/02/1894 Drumshanbo, Co Leitrim"]
[407,34,"Ronan","Prudentia","",87,"13/06/1948","Nazareth Nun",3,"Long Tower Boys School Graveyard ",11,"Born 31/03/1860 Dublin."]
[408,35,"Brady","Joseph","",66,"23/03/1949","Nazareth Nun",3,"Long Tower Boys School Graveyard ",11,"Born 28/10/1882 Ballyduddy Co Longford."]
[409,36,"Farrelly","Agnes","",76,"26/04/1949","Nazareth Nun",3,"Long Tower Boys School Graveyard ",11,"Born 28/07/1872 Belfast."]
[410,37,"Cassidy","Joseph Augustine","",88,"12/06/1968","Nazareth Nun",3,"Long Tower Boys School Graveyard ",11,"Born 27/03/1880 Maghera Co Derry"]
[411,38,"Timony","Mary de Sales","",81,"20/12/1962","Nazareth Nun",3,"Long Tower Boys School Graveyard ",11,"Born 22/03/1881 Belfast"]
[412,39,"Martin","Mary Sylvester","",72,"20/10/1964","Nazareth Nun",3,"Long Tower Boys School Graveyard ",11,"Born 02/02/1894 Carrickmacross Co Monaghan"]
[413,40,"O'Beirne","Mary Thomas","",63,"11/10/1965","Nazareth Nun",3,"Long Tower Boys School Graveyard ",11,"Born 28/02/1902 London"]
[414,41,"O'Kane","Columba Mary","",81,"01/08/1975","Nazareth Nun",3,"Long Tower Boys School Graveyard ",11,"Born 03/08/1893 Claudy Co Derry"]
[415,42,"Brady","Agnes Gabriel","",72,"15/09/1979","Nazareth Nun",3,"Long Tower Boys School Graveyard ",11,"Born 21/03/1907 Lismulligan Co Down."]
[416,43,"Ward","Mary of the Rosary","",83,"03/05/1962","Nazareth Nun",3,"Long Tower Boys School Graveyard ",11,"Born 26/05/1978 Glenties Co Donegal"]
[417,44,"Harbison","Mary Alexander","",84,"11/12/1963","Nazareth Nun",3,"Long Tower Boys School Graveyard ",11,"Born 28/03/1879 Moneymore Co Down"]
[418,45,"Conaghan","Mary Arsenius","",73,"19/02/1966","Nazareth Nun",3,"Long Tower Boys School Graveyard ",11,"Born 11/06/1892 Claggan Co Donegal"]
[419,46,"Mc Mullan","Teresa Agnes","",81,"11/02/1968","Nazareth Nun",3,"Long Tower Boys School Graveyard ",11,"Born 03/06/1886 Moville Co Donegal."]
[420,47,"Hickey","Thomas D","",56,"17/05/1974","Christian Bro.",3,"Long Tower Boys School Graveyard ",12,""]
[421,48,"Croghan","Joseph","",83,"25/02/1912","Christian Bro.",3,"Long Tower Boys School Graveyard ",13,"Hailed from Roscommon"]
[422,49,"Burgess","George Stanley","",73,"22/05/1978","Christian Bro.",3,"Long Tower Boys School Graveyard ",14,""]
[423,50,"Mc Faden","Anne","",55,"28/06/1842","",3,"Long Tower Boys School Graveyard ",15,""]
[424,51,"Farren","Daniel","",28,"","",3,"Long Tower Boys School Graveyard ",16,""]
[425,52,"Mc Dermott","James","",null,"","",3,"Long Tower Boys School Graveyard ",17,""]
[426,53,"Boyle","Ellen","",55,"23/03/1859","",3,"Long Tower Boys School Graveyard ",18,""]
[427,54,"Breslan","James","15 Long Tower St",0,"27/03/1899","Slater",3,"Long Tower Boys School Graveyard ",0,""]
[428,45,"O'Doherty","Sarah","",70,"01/03/1822","",4,"East Door Graveyard",19,""]
[429,46,"Duddy","Ellen","No Obit",30,"08/02/1879","",4,"East Door Graveyard",20,""]
[430,47,"Red???","Ja's","",null,"29/01/1799","",4,"East Door Graveyard",21,""]
[431,48,"O'Cahan","Rose","",41,"27/07/1779","",4,"East Door Graveyard",22,""]
[432,49,"McCafferty","James","",72,"","",4,"East Door Graveyard",23,"died 1791"]
[433,50,"McCafferty","Susanna","",52,"","",4,"East Door Graveyard",23,"died 1786"]
[434,51,"McCafferty","Patrick","",87,"","",4,"East Door Graveyard",23,"died 1843"]
[435,52,"Neely","Charles","",46,"18/02/1840","",4,"East Door Graveyard",24,""]
[436,53,"Neely","Elizabeth","No Obit",79,"21/01/1865","",4,"East Door Graveyard",24,""]
[437,54,"Concannon","Robert Joe","56 Deanery Street",null,"05/05/1921","",4,"East Door Graveyard",25,"Eldest son of John"]
[438,55,"Concannon","Annie","56 Deanery Street",null,"17/05/1925","",4,"East Door Graveyard",25,"4th Daughter of John and Margaret"]
[439,56,"Concannon","John","56 Deanery Street",null,"19/03/1941","Docker",4,"East Door Graveyard",25,"Husband of Margeret"]
[440,2,"Donnelly","Anne","No Obit",24,"25/03/1867","",4,"East Door Graveyard",2,""]
[441,4,"Murphy","William","",52,"08/01/1857","",4,"East Door Graveyard",4,""]
[442,5,"Murphy","Bridget","No Obit",22,"20/05/1849","",4,"East Door Graveyard",4,""]
[443,6,"Kelpie","Patrick","No Obit",48,"26/07/1880","",4,"East Door Graveyard",5,""]
[444,7,"Kelpie","Adelaide","No Obit",36,"22/04/1873","",4,"East Door Graveyard",5,""]
[445,8,"Carolan","Patrick","No Obit",66,"20/04/1859","",4,"East Door Graveyard",6,""]
[446,9,"Carolan","Hanna","",0,"","",4,"East Door Graveyard",6,""]
[447,10,"Mc Sheffry","John","",40,"","",4,"East Door Graveyard",7,""]
[448,11,"Doherty","John","No Obit",1,"20/07/1875","",4,"East Door Graveyard",8,""]
[449,12,"Doherty","Bridget","116 Bishop St",16,"19/03/1896","",4,{"$f":"VLOOKUP(I451,Graveyards,2,2)","v":"East Door Graveyard"},8,"Youngest Daughter John Doherty Baker"]
[450,13,"Doherty","John","Bishop Street",70,"05/11/1916","Baker",4,"East Door Graveyard",8,""]
[451,14,"Doherty","Anne","116 Bishop St",null,"23/03/1919","",4,"East Door Graveyard",8,"Wife of No 13"]
[452,15,"Doherty","Elizabeth","114 Bishop St.",null,"19/03/1920","",4,"East Door Graveyard",8,"Oldest Daughter of No 13"]
[453,16,"Doherty","Margaret","114 Bishop St.",null,"19/03/1922","",4,"East Door Graveyard",8,"Third Daughter of No 13 He was a Master baker."]
[454,17,"Grieve","William","93 Bishop St",null,"21/05/1922","",4,"East Door Graveyard",9,"Hailed From Claudy"]
[455,18,"Grieve","Margaret","93 Bishop St.",58,"23/08/1897","",4,"East Door Graveyard",9,"Died In Buncrana, Sis of Pat McMonagle Butcher St"]
[456,19,"Quigley","Philip","Abercorn Road",null,"19/12/1883","",4,"East Door Graveyard",11,""]
[457,20,"Quigley","Emma","9 Abercorn Road",null,"16/02/1889","",4,"East Door Graveyard",11,"Relict of Phillip Quigley"]
[458,21,"Quigley","William","9 Abercorn Road",null,"14/08/1902","Joiner",4,"East Door Graveyard",11,"City and County infirmary result of accident"]
[459,22,"Hannigan","Sarah","No Obit",74,"08/01/1847","",4,"East Door Graveyard",12,""]
[460,23,"Hanagan","Neal","Bennet St",91,"15/09/1864","",4,"East Door Graveyard",12,""]
[461,24,"Browne","Stephen","",null,"","",4,"East Door Graveyard",null,""]
[462,25,"Browne","Ellen","",null,"","",4,"East Door Graveyard",null,""]
[463,26,"Browne","Dorothea","",null,"","",4,"East Door Graveyard",null,""]
[464,27,"Browne","Ellen","",null,"","",4,"East Door Graveyard",null,""]
[465,28,"Browne","William","Bishop St Fountain St",72,"18/12/1892","Butcher",4,"East Door Graveyard",13,""]
[466,29,"McLaughlin","Catherine","No Obit",1,"01/04/1846","",4,"East Door Graveyard",14,""]
[467,30,"McLaughlin","Elizabeth","",6,"","",4,"East Door Graveyard",14,""]
[468,31,"Gallagher","Rose Ann","No Obit",null,"01/06/1849","",4,"East Door Graveyard",15,"Erected by her son Richard Gallagher, son"]
[469,32,"Gallagher","Margaret","No Obit",null,"01/03/1859","",4,"East Door Graveyard",15,""]
[470,33,"Gallagher","Susan","Ballymacarry Parks",null,"10/08/1892","",4,"East Door Graveyard",15,"Buncrana.Wife Richard Gallagher Castle Gate Build"]
[471,34,"Gallagher","Lucinda","Woodlands,Fahan",null,"18/09/1903","",4,"East Door Graveyard",15,"Wife of Richard Gallagher Waterloo Street"]
[472,35,"Gallagher","Richard","Castle Gate Buildings",null,"10/11/1908","Victualler",4,"East Door Graveyard",15,""]
[473,36,"Concannon","John","",53,"","",4,"East Door Graveyard",16,""]
[474,37,"Concannon","Andrew","",1,"","",4,"East Door Graveyard",16,"Grandson to No 36."]
[475,38,"Canning","Elizabeth","",70,"05/04/1857","",4,"East Door Graveyard",17,""]
[476,39,"Canning","Henry","",17,"05/04/1857","",4,"East Door Graveyard",17,""]
[477,40,"Canning","Anthony","",null,"","",4,"East Door Graveyard",17,"Died 1857"]
[478,41,"Doherty","Richard","",null,"","",4,"East Door Graveyard",18,""]
[479,42,"Doherty","Mary","",null,"","",4,"East Door Graveyard",18,""]
[480,43,"Doherty","Bernard","",null,"","",4,"East Door Graveyard",18,""]
[481,44,"Doherty","Daniel","",null,"","",4,"East Door Graveyard",18,""]
[482,1,"Mc Calley","Barbara","No Obit",66,"17/01/1859","",4,"East Door Graveyard",1,""]
[483,1,"Mc Laughlin","Charles","No Obit",49,"12/12/1855","",5,"West Door Graveyard",1,""]
[484,2,"Donaghey","","",null,"","",5,"West Door Graveyard",2,""]
[485,3,"Doyle","Anne","",80,"26/10/1827","",5,"West Door Graveyard",3,""]
[486,4,"McCloskey","Rodger","",30,"28/06/1850","",5,"West Door Graveyard",4,""]
[487,5,"Fleming","Charles","",27,"27/10/1840","",5,"West Door Graveyard",5,""]
[488,6,"Fleming","Margaret","",2,"16/02/1850","",5,"West Door Graveyard",5,""]
[489,7,"Coyle","Angela","No Obit",1,"02/10/1854","",5,"West Door Graveyard",6,""]
[490,8,"Coyle","Daniel","No Obit",7,"24/11/1858","",5,"West Door Graveyard",6,""]
[491,9,"Sawers","Francis","",null,"","",5,"West Door Graveyard",7,"Died approx 1845"]
[492,10,"Nellis","John","No Obit",75,"05/03/1858","",5,"West Door Graveyard",8,""]
[493,11,"Nellis","Ellen","No Obit",75,"02/07/1864","",5,"West Door Graveyard",8,""]
[494,12,"Doherty","Mary Ann","109 St Columbs Wells",14,"22/11/1896","",5,"West Door Graveyard",9,""]
[495,13,"Doherty","Wee Winnie","Howard St",4,"14/09/1895","",5,"West Door Graveyard",9,"Sister of 12"]
[496,14,"McElwee","Denis","No Obit",37,"26/12/1848","",5,"West Door Graveyard",10,""]
[497,15,"O'Flynn","Joseph","164 Bishop Street",5,"02/04/1877","",5,"West Door Graveyard",11,"Born 01/04/1872 3rd son of Bernard O'Flynn formerl"]
[498,16,"O'Flynn","Ida","5 Brandywell Ave",null,"02/11/1919","",5,"West Door Graveyard",11,"Daughter of 17 & 18,Buried in City Cemetery"]
[499,17,"O'Flynn","Winifred","5 Brandywell Ave",null,"16/02/1932","",5,"West Door Graveyard",11,"Mother of No 16"]
[500,18,"O'Flynn","Thomas","5 Brandywell Ave",null,"15/01/1941","",5,"West Door Graveyard",11,"Father of No 16"]
[501,19,"O'Kane","Daniel B","9 Victoria Tce Artillery St",null,"31/10/1895","",5,"West Door Graveyard",12,"Obit on Gravestone Page 54"]
[502,20,"Gallagher","Mary Ann","37 Waterloo St",null,"02/03/1905","Fleshers daughter",5,"West Door Graveyard",13,""]
[503,21,"Hegarty","Eleanor","No Obit",78,"04/01/1855","",5,"West Door Graveyard",14,"Mother of James Hegarty"]
[504,22,"Hegarty","Frances Martena","Diamond",1,"08/10/1868","",5,"West Door Graveyard",14,"Daughter of James Hegarty"]
[505,23,"McMahon","John","4 Brandywell Rd",72,"06/05/1912","",5,"West Door Graveyard",15,"Eldest Son of Patrick"]
[506,24,"McMahon","Margaret","No Obit",35,"25/02/1877","",5,"West Door Graveyard",15,"Wife of 23"]
[507,25,"Kerr","A","",null,"","",5,"West Door Graveyard",16,""]
[508,26,"Hegarty","Mary","",79,"15/01/1850","",5,"West Door Graveyard",17,""]
[509,27,"Elliott","Thomas","",null,"","",5,"West Door Graveyard",18,""]
[510,28,"Gallagher","Mary","",62,"04/12/1850","",5,"West Door Graveyard",19,""]
[511,29,"McLaughlin","James","",null,"","",5,"West Door Graveyard",20,""]
[512,30,"McLaughlin","Charles","",null,"","",5,"West Door Graveyard",20,""]
[513,31,"McDermott","Fanny","",51,"06/05/1851","",5,{"$f":"VLOOKUP(I515,Graveyards,2,2)","v":"West Door Graveyard"},20,"Wife toTommy McDermott"]
[514,32,"McDermott","Roseanne","",null,"","",5,"West Door Graveyard",21,"Died young"]
[515,33,"Conway","Alice","No Obit",48,"03/01/1848","",5,"West Door Graveyard",22,""]
[516,34,"Conway","John","No Obit",58,"17/05/1859","",5,"West Door Graveyard",22,""]
[517,35,"Boyle","Sarah","No Obit",null,"19/01/1847","",5,"West Door Graveyard",23,""]
[518,36,"Murphy","Francis","No Obit",75,"21/02/1854","",5,"West Door Graveyard",24,""]
[519,37,"Peake","Anne","",20,"29/03/1863","",5,"West Door Graveyard",25,""]
[520,38,"Boyle","Daniel","No Obit",null,"","",5,"West Door Graveyard",26,""]
[521,39,"White","Elizabeth","No Obit",53,"05/01/1867","",5,"West Door Graveyard",27,"Daughter of 39"]
[522,40,"White","Sarah Anne","",25,"","",5,"West Door Graveyard",27,""]
[523,41,"White","John","73 Fahan St",68,"12/11/1881","Tobacconist",5,"West Door Graveyard",27,"Husband of 39"]
[524,42,"Canning","Anthony","Black-Bush",86,"19/03/1852","",5,"West Door Graveyard",28,"Formerly of Letterkenny"]
[525,43,"Doherty","Harriet","",59,"11/05/1834","",5,"West Door Graveyard",29,"Erected by Daniel Doherty son"]
[526,44,"Doherty","May","",27,"29/09/1836","",5,"West Door Graveyard",29,"Daughter to 43"]
[527,45,"Doherty","Winifred","21 Howard St",33,"10/10/1892","",5,"West Door Graveyard",29,"Wife of Daniel Doherty"]
[528,46,"Doherty","Edward","124 St Columb's Wells",null,"05/03/1893","",5,"West Door Graveyard",29,"Father to Daniel Doherty"]
[529,47,"McEwan","Harriet","20 Limewood St",null,"16/07/1943","",5,"West Door Graveyard",29,"Wife to A Mc Ewan 20 Limewood St"]
[530,48,"O'Doherty","John","9 Princes St",72,"08/07/1883","",5,"West Door Graveyard",30,"Husband of No 49"]
[531,49,"O'Doherty","Ellen","No Obit",54,"12/01/1860","",5,"West Door Graveyard",30,""]
[532,50,"O'Doherty","Joseph","Castlederg",49,"18/11/1882","Catholic Curate",5,"West Door Graveyard",30,"Ordained 21/05/1861(Urney)"]
[533,51,"O'Doherty","Philip","P.P.",null,"25/02/1897","Monsignor",5,"West Door Graveyard",30,"Born 1851,Ordained 1st July 1877."]
[534,52,"Gallagher","Patrick","No Obit",68,"08/12/1857","",5,"West Door Graveyard",31,""]
[535,53,"Gallagher","Anne","No Obit",55,"20/12/1849","",5,"West Door Graveyard",31,""]
[536,55,"Webb","Ellen","No Obit",26,"12/05/1879","",5,"West Door Graveyard",32,""]
[537,56,"Nelis","Jane","",17,"22/09/1850","",5,"West Door Graveyard",8,"Daughter to No 10"]
[538,57,"Nelis","Elizabeth","No Obit",23,"24/02/1866","",5,"West Door Graveyard",8,""]
[539,58,"Coyle","Hugh","No Obit",24,"14/08/1880","",5,"West Door Graveyard",33,""]
[540,59,"Long","Patrick","No Obit",55,"29/01/1858","",5,"West Door Graveyard",34,""]
[541,60,"McDaid","Rosan","No Obit",null,"24/12/1863","",5,"West Door Graveyard",35,""]
[542,61,"McGilway","John","",38,"23/10/1850","",5,"West Door Graveyard",36,""]
[543,62,"Gallagher","John","No Obit",14,"20/01/1852","",5,"West Door Graveyard",37,""]
[544,63,"Roddy","John","",null,"","",5,"West Door Graveyard",38,""]
[545,64,"Mullholland","Stephen","",26,"30/03/1850","",5,"West Door Graveyard",39,""]
[546,65,"McElligott","Denis","No Obit",50,"01/04/1849","Qr Mr Sergt",5,"West Door Graveyard",40,"Born in O'Dorney Co.Kerry."]
[547,66,"Conway","Thomas","",50,"","",5,"West Door Graveyard",41,"Died 27th June"]
[548,67,"McMonagle","David","No Obit",18,"25/02/1847","",5,"West Door Graveyard",42,"Erected by his father Patrick"]
[549,68,"Mills","Mary","Bishop St Without",0,"16/09/1845","",5,"West Door Graveyard",0,"Wife of John Mills"]
[550,71,"Harkin","John","",65,"01/11/1851","",5,"West Door Graveyard",0,""]

{"sheet":"Graveyards","index":2,"n_rows":7,"n_cols":3,"rows_kept":7,"cut":false,"hidden":false,"merged":[]}
[null,"#","Graveyard descriptions."]
[null,0,"Unknown"]
[null,1,"North Door Graveyard"]
[null,2,"Long Tower Girls School Graveyard"]
[null,3,"Long Tower Boys School Graveyard "]
[null,4,"East Door Graveyard"]
[null,5,"West Door Graveyard"]

{"sheet":"Search ","index":3,"n_rows":32,"n_cols":28,"rows_kept":32,"cut":false,"hidden":false,"merged":[[24,6,24,7],[26,6,26,11],[20,6,20,7],[20,2,20,4],[20,8,20,11],[18,6,18,13],[2,1,3,25],[10,6,10,11],[12,6,12,11],[14,6,14,7],[16,6,16,9]]}
[]
[null,550]
[null,"S E A R C H     F O R M"]
[]
[]
[]
[]
[]
[]
[]
[null,null,null,null,null,null,{"$f":"INDEX(Aras_DB!A3:L552,'Search '!B2,5)","v":""}]
[]
[null,null,null,null,null,null,{"$f":"INDEX(Aras_DB!A3:L552,'Search '!B2,7)","v":"01/11/1851"}]
[]
[null,null,null,null,null,null,{"$f":"INDEX(Aras_DB!A3:L552,'Search '!B2,6)","v":65}]
[]
[null,null,null,null,null,null,{"$f":"INDEX(Aras_DB!A3:L552,'Search '!B2,8)","v":""}]
[]
[null,null,null,null,null,null,{"$f":"INDEX(Aras_DB!A3:L552,'Search '!B2,12)","v":""}]
[]
[null,null,"ID_OLD :",null,null,null,{"$f":"INDEX(Aras_DB!A3:L552,'Search '!B2,2)","v":71},null,"(Referenced in Other Comments)"]
[]
[]
[]
[null,null,null,null,null,null,{"$f":"INDEX(Aras_DB!A3:L552,'Search '!B2,11)","v":0}]
[]
[null,null,null,null,null,null,{"$f":"INDEX(Aras_DB!A3:L552,'Search '!B2,10)","v":"West Door Graveyard"}]
[]
[]
[]
[]
[null,null,null,null,null,null,null,null,null,null,null,null,null,null,null,null,null,null,null,null,null,null,null,null,null,null,null," "]