{"text_format":"1","workbook":"xlsx","n_sheets":4,"sheets":["No Given Grave","Aras_DB","Graveyards","Search "],"not_rendered":{"charts":0,"images":12,"macros":1,"external_links":0,"defined_names":2,"comments":2,"pivot_tables":0},"unopened":[],"bounds":{"document_bytes":16777216,"sheet_cells":100000,"rows_first":2000,"rows_last":500,"rows_between":2000,"halvings":0,"cell_chars":16384,"cell_head_chars":4096},"cells_cut":0,"cells_raw":0,"read":"whole","date_system":"1900"}

{"sheet":"No Given Grave","index":0,"n_rows":551,"n_cols":11,"rows_kept":551,"cut":false,"hidden":true,"merged":[]}
["ID_old","ID","Surname","Chrisian Name","Address","Graveyard Number","Grave Number","Age","Date of Death","Occupation","Any Other Comments"]
[5,1,"Mc Devitt","Patrick","14 Waterloo Street",0,null,68,"04/07/1875","",""]
[6,2,"Quigley","Phillip","Abercorn Road",0,null,77,"19/12/1883","",""]
[7,3,"McClafferty","Mary","21 Abbey Street",0,null,null,"18/12/1883","",""]
[8,4,"Doherty","Winnifred","21 Howard Street",0,null,33,"09/10/1892","","Mothers Address.Husband Daniel Doherty,Mason"]
[2,5,"Mc Donnell","Sarah","10 Linenhall St",0,null,5,"15/10/1892","","Daughter of William Mc Donnell"]
[1,6,"Nugent","Ellen","47 Creggan Street",0,null,0,"13/10/1892","","Uncles Residence."]
[9,7,"Cuthbert","Wliiam","Ferryquay Street",0,null,null,"05/10/1892",""," At Brothers Residence."]
[10,8,"Quigley","Joseph","30 Ivy Terrace",0,null,19,"30/10/1892","","Son of Phillip"]
[11,9,"Friel","Patrick","London Street",0,null,null,"13/08/1892","Merchant of City",""]
[12,10,"Gallagher","Susan","Ballymacarry,Parks",0,null,0,"","","Buncrana,"]
[13,11,"Concannon","Richard","45 WellingtonSt",0,null,null,"18/07/1892","",""]
[14,12,"Mc Keever","John","3 Little Diamond",0,null,0,"02/07/1902","","Son of Patrick Mc Keever"]
[15,13,"Doherty","Bridget","116 Bishop Street",0,null,16,"19/03/1896","","Youngest Daughter of John Doherty Baker."]
[16,14,"Conaghan","Margaret","Linenhall Street",0,null,null,"12/02/1896","","At Mary Margt Harts Residence Linenhall Street"]
[17,15,"Havlin","Catherine","87 St Columbs Wells",0,null,48,"13/03/1896","","Relict of the late Edward"]
[18,16,"Lynch","Edward","42 William  Street",0,null,65,"26/05/1879","",""]
[19,17,"McGettigan","Mary Anne","Ballyougry",0,null,34,"24/05/1879","","Wife of Neal McGettigan"]
[20,18,"Doherty","Ellen","Racecourse",0,null,null,"15/06/1879","","Only Daughter of the late John Doherty"]
[21,19,"Deehan","Mary","75 Rossville Street",0,null,38,"02/06/1879","","Wife of John Deehan Compositor"]
[22,20,"Craig","Anne","Glassaugh",0,null,70,"15/01/1879","","Nee Carolau,wife to George,sister of Thomas."]
[23,21,"McLaughlin","Joseph","66 Rossville Street",0,null,63,"08/01/1869","",""]
[24,22,"Keys","Ellen","",0,null,0,"","",""]
[0,23,"Mc Daid","Patrick","16 Creggan Street",0,null,0,"17/09/1903","Senior Butcher",""]
[26,24,"Gallagher","Richard","Marlborough Tce",0,null,0,"03/09/1907","H.M. Customs.",""]
[27,25,"McDonnell","William","10 Linenhall Street",0,null,0,"29/07/1907","",""]
[28,26,"Doherty","Margaret","Racecourse",0,null,0,"31/01/1874","","Wife of John Doherty"]
[29,27,"Collins","Mary","10 William Street",0,null,null,"10/01/1900","","Daughter of late William Collins"]
[30,28,"Mc Daid","James","39 Bishop Street",0,null,0,"30/10/1896","Butcher",""]
[31,29,"Mc Ginley","Lizzie","126 Bogside",0,null,0,"24/04/1894","","Second daughter of Michael Mc Ginley Builder."]
[3,30,"Macdevette","James","62 William Street",0,null,70,"14/04/1873","",""]
[4,31,"McLaughlin","Margaret","Ferguson Street",0,null,38,"19/03/1873","","Daughter of the late Andrew Mc Laughlin"]
[1,32,"Mehan","James","",1,1,19,"12/02/1851","",""]
[2,33,"Mehan","Joseph","",1,1,2,"15/12/1832","",""]
[3,34,"Mehan","William","",1,1,3,"","",""]
[4,35,"Mehan","Joseph","",1,1,14,"01/01/1846","",""]
[5,36,"Kelly","Cornelius","",1,2,51,"22/03/1833","R.N. Surgeon",""]
[6,37,"Kelly","Thomas Patrick","",1,2,1,"24/06/1823","","Son of No 5"]
[7,38,"Mc Daid","James","",1,3,null,"","",""]
[8,39,"Mc Daid","Ellen","",1,3,null,"10/10/1897","","Wife of No 7"]
[9,40,"Mc Daid","Richard","",1,3,null,"29/04/1916","","Son of No's 7 and 8"]
[10,41,"O'Scally","John","",1,4,68,"11/06/1824","Captain",""]
[11,42,"Mc Feely","Ann","",1,4,25,"06/06/1833","","Daughter of No 10"]
[12,43,"Mc Feely","John","Foyle St",1,4,28,"24/09/1860","","Son of No 11"]
[13,44,"Devlin","Robert","",1,5,34,"13/02/1840","",""]
[14,45,"Devlin","William","",1,5,null,"","","Son of No 13"]
[15,46,"Devlin","James","",1,5,null,"","","Son of No 13"]
[16,47,"Devlin","Maria","",1,5,null,"","","Daughter of No 13"]
[17,48,"Casey","Hugh","",1,6,51,"02/07/1838","",""]
[18,49,"Casey","Margaret","",1,6,21,"19/11/1843",""," Daughter of No 17"]
[19,50,"Doherty","Margaret","",1,6,80,"12/09/1859","","Mother-in-Law to No 17"]
[20,51,"Collins","Anthony","",1,7,51,"16/11/1837","",""]
[21,52,"Collins","Sarah","",1,7,62,"05/05/1844","","Wife of No 20"]
[22,53,"Collins","Anthony","",1,7,36,"02/12/1852","","Son of 20 and 21"]
[23,54,"Collins","Ann","",1,7,17,"21/05/1858","","Grand-daughter of 20 and 21"]
[24,55,"Collins","William","",1,7,73,"11/10/1880","",""]
[25,56,"Collins","Rose","10 Wiliiam Street",1,7,72,"05/10/1885","","Wife of No 24"]
[26,57,"Collins","Catherine","10 William Street",1,7,36,"23/05/1886","","Daughter of No 24 and 25"]
[27,58,"Collins","Mary","",1,7,42,"10/01/1901","","."]
[28,59,"Collins","Anthony","",1,7,null,"28/12/1921","",""]
[29,60,"Mooney","Margaret","",1,8,33,"","",""]
[30,61,"Mooney","Ann","",1,8,42,"","",""]
[31,62,"Mooney","Joseph","",1,8,52,"05/02/1852","",""]
[32,63,"White","Mary Jane","",1,8,27,"16/04/1853","","Daughter of Thomas White"]
[33,64,"Mooney","Jane","",1,8,50,"12/07/1848","",""]
[34,65,"Mooney","Rosa","20 Gt James Street",1,8,76,"02/02/1860","",""]
[35,66,"Hassan","Elizabeth","",1,8,74,"16/02/1870","","Servant to Mooneys 50 yrs"]
[36,67,"Mooney","John","",1,8,64,"02/04/1813","",""]
[37,68,"Mooney","Anne","",1,8,74,"16/06/1827","","Wife of No 36"]
[38,69,"Murray","Thomas","",1,9,null,"","","Burying Ground Only"]
[39,70,"Nugent","John","",1,10,46,"07/03/1848","",""]
[40,71,"Brown","Mary Ann","",1,10,25,"05/03/1850","","Daughter of No 39"]
[41,72,"Brown","John","",1,10,1,"17/06/1849","","Son of No 40"]
[42,73,"Nugent","Mary","5 Foyle St.",1,10,78,"20/05/1877","","Wife of No 39"]
[43,74,"Mc Laughlin","Maggie G","",1,10,26,"05/03/1884","","Granddaughter of No 39"]
[44,75,"Mc Laughlin","Ellen Nugent","",1,10,76,"24/11/1905","","Daughter of No 39"]
[45,76,"Casey","Phillip","",1,11,84,"14/09/1832","",""]
[46,77,"Casey","Cecilia","",1,11,79,"23/03/1843","","Wife of No 45"]
[47,78,"Fleming","Charles","Castle Street",1,12,71,"07/01/1890","",""]
[48,79,"O'Donnell","Thomas","Foyle Road",1,13,87,"27/07/1861","",""]
[49,80,"O'Donnell","Esther","Foyle Road",1,13,74,"21/10/1868","","Wife of No 48"]
[50,81,"O'Donnell","William","Foyle Road",1,13,72,"21/02/1909","","Son of No,s 48 and 49"]
[51,82,"O'Donnell","Mary","Foyle Road",1,13,null,"06/03/1879","","Daughter of No,s 48 and 49"]
[52,83,"O.Donnell","Thomas","Foyle Road",1,13,null,"28/02/1898","","Son of No,s 48 and 49"]
[53,84,"O.Donnell","Esther","Foyle Road",1,13,null,"11/03/1909","","Daughter of No,s 48 and 49"]
[54,85,"Mc Kinney","Ellen","",1,14,15,"07/07/1852","",""]
[55,86,"Doherty","Sarah","",1,15,null,"","","Wife of William Doherty"]
[56,87,"Mc Feely","Bridget","",1,16,28,"19/11/1827","",""]
[57,88,"Mc Feely","Bryan","",1,16,53,"01/05/1850","",""]
[58,89,"Mc Feely","Ellen","",1,16,56,"19/11/1846","",""]
[59,90,"Mc Feely","Mary","Foyle Street",1,16,45,"04/11/1851","",""]
[60,91,"Mc Feely","Michael","",1,16,77,"29/06/1868","",""]
[61,92,"Mc Feely","Michael","Foyle St.",1,16,33,"18/06/1872","","only Surviving Son of Late Michael Mc Feely"]
[62,93,"Keys","George","Creevagh",1,17,99,"15/11/1903","","Uncle of Bp J K O'Doherty"]
[63,94,"Heaney","Bernard","",1,18,57,"19/02/1857","",""]
[64,95,"Heaney","Bridget","9 Henrietta St",1,18,72,"15/12/1862","","Wife of No 63"]
[65,96,"Griffin","Mary Ann","",1,19,25,"13/11/1826","","Wife of Michael Griffin"]
[66,97,"Mc Clean","Dr William","Butcher St Derry",1,20,23,"05/09/1833","",""]
[67,98,"Mc Clean","Charles","",1,20,12,"09/02/1842","","Brother of No 66"]
[68,99,"Mc Clean","Patrick","",1,20,23,"17/02/1850","","Brother of No 66"]
[69,100,"Mc Clean","Neal","Butcher St",1,20,34,"29/01/1851","","Brother of No 66"]
[70,101,"Mc Clean","Neal Snr","Butcher St",1,20,73,"07/04/1851","","Father of No,s 66,67,68,69"]
[71,102,"Doherty","Margaret","",1,21,70,"10/12/1920","",""]
[72,103,"Doherty","Daniel","",1,21,null,"14/12/1914","","Husband of No 71"]
[73,104,"Gill","Ann","",1,null,60,"","",""]
[74,105,"Mc Cafferty","Andrew","Woodlands, Fahan",1,22,69,"16/05/1888","",""]
[75,106,"Mc Cafferty","Margaret","",1,22,79,"18/03/1894","","Wife of No 74"]
[76,107,"Mc Cafferty","Margaret","Victoria Place",1,22,29,"11/10/1873","","Daughter of Andrew, Victoria Place"]
[77,108,"Mc Cafferty","Daniel","",1,22,null,"17/06/1885","",""]
[78,109,"Mc Cafferty","Andrew","",1,22,null,"","","Died in Infancy"]
[79,110,"Mc Cafferty","James","",1,22,null,"","","Died in Infancy"]
[80,111,"Mc Cafferty","Annie","",1,22,null,"","","Died in Infancy"]
[81,112,"Mc Cafferty","Joseph","No Record",1,22,null,"20/11/1885","",""]
[82,113,"Mc Cafferty","Mary","Woodlands, Fahan.",1,22,null,"25/10/1896","",""]
[83,114,"Mc Cafferty","Andrew","18 Clooney terrace",1,22,43,"26/02/1893","Solicitor","Interred in City Cemetery"]
[84,115,"Henry","Henry","",1,22,null,"","","Grandparents"]
[85,116,"Henry","Mary","",1,22,null,"","","to above"]
[86,117,"O'Doherty","Edward","Formerly of Molenan, Died at Whitehouse.",1,23,84,"09/05/1872","","Father of Bp J K O'Doherty"]
[87,118,"O'Doherty","Margaret","",1,23,66,"13/09/1869","","Mother of Bp J K O'Doherty"]
[88,119,"O'Doherty","Margaret Sarah","Molenan",1,23,34,"07/04/1860","","Sister of Bp John Keys O'Doherty"]
{"$rows_left_out":432}
{"sheet":"Aras_DB","index":1,"n_rows":552,"n_cols":12,"rows_kept":552,"cut":false,"hidden":false,"merged":[[0,0,0,11]]}
[]
["ID","ID_old","Surname","Forename","Address","Age","Date of Death","Occupation","Graveyard Number","Grave Yard Location","Grave Number","Any Other Comments"]
[1,5,"Mc Devitt","Patrick","14 Waterloo Street",68,"04/07/1875","",0,{"$f":"VLOOKUP(I3,Graveyards,2,2)","v":"Unknown"},null,""]
[2,6,"Quigley","Phillip","Abercorn Road",77,"19/12/1883","",0,"Unknown",null,""]
[3,7,"McClafferty","Mary","21 Abbey Street",null,"18/12/1883","",0,"Unknown",null,""]
[4,8,"Doherty","Winnifred","21 Howard Street",33,"09/10/1892","",0,"Unknown",null,"Mothers Address.Husband Daniel Doherty,Mason"]
[5,2,"Mc Donnell","Sarah","10 Linenhall St",5,"15/10/1892","",0,"Unknown",null,"Daughter of William Mc Donnell"]
[6,1,"Nugent","Ellen","47 Creggan Street",0,"13/10/1892","",0,"Unknown",null,"Uncles Residence."]
[7,9,"Cuthbert","Wliiam","Ferryquay Street",null,"05/10/1892","",0,"Unknown",null," At Brothers Residence."]
[8,10,"Quigley","Joseph","30 Ivy Terrace",19,"30/10/1892","",0,"Unknown",null,"Son of Phillip"]
[9,11,"Friel","Patrick","London Street",null,"13/08/1892","Merchant of City",0,"Unknown",null,""]
[10,12,"Gallagher","Susan","Ballymacarry,Parks",0,"","",0,"Unknown",null,"Buncrana,"]
[11,13,"Concannon","Richard","45 WellingtonSt",null,"18/07/1892","",0,"Unknown",null,""]
[12,14,"Mc Keever","John","3 Little Diamond",0,"02/07/1902","",0,"Unknown",null,"Son of Patrick Mc Keever"]
[13,15,"Doherty","Bridget","116 Bishop Street",16,"19/03/1896","",0,"Unknown",null,"Youngest Daughter of John Doherty Baker."]
[14,16,"Conaghan","Margaret","Linenhall Street",null,"12/02/1896","",0,"Unknown",null,"At Mary Margt Harts Residence Linenhall Street"]
[15,17,"Havlin","Catherine","87 St Columbs Wells",48,"13/03/1896","",0,"Unknown",null,"Relict of the late Edward"]
[16,18,"Lynch","Edward","42 William  Street",65,"26/05/1879","",0,"Unknown",null,""]
[17,19,"McGettigan","Mary Anne","Ballyougry",34,"24/05/1879","",0,"Unknown",null,"Wife of Neal McGettigan"]
[18,20,"Doherty","Ellen","Racecourse",null,"15/06/1879","",0,"Unknown",null,"Only Daughter of the late John Doherty"]
[19,21,"Deehan","Mary","75 Rossville Street",38,"02/06/1879","",0,"Unknown",null,"Wife of John Deehan Compositor"]
[20,22,"Craig","Anne","Glassaugh",70,"15/01/1879","",0,"Unknown",null,"Nee Carolau,wife to George,sister of Thomas."]
[21,23,"McLaughlin","Joseph","66 Rossville Street",63,"08/01/1869","",0,"Unknown",null,""]
[22,24,"Keys","Ellen","",0,"","",0,"Unknown",null,""]
[23,0,"Mc Daid","Patrick","16 Creggan Street",0,"17/09/1903","Senior Butcher",0,"Unknown",null,""]
[24,26,"Gallagher","Richard","Marlborough Tce",0,"03/09/1907","H.M. Customs.",0,"Unknown",null,""]
[25,27,"McDonnell","William","10 Linenhall Street",0,"29/07/1907","",0,"Unknown",null,""]
[26,28,"Doherty","Margaret","Racecourse",0,"31/01/1874","",0,"Unknown",null,"Wife of John Doherty"]
[27,29,"Collins","Mary","10 William Street",null,"10/01/1900","",0,"Unknown",null,"Daughter of late William Collins"]
[28,30,"Mc Daid","James","39 Bishop Street",0,"30/10/1896","Butcher",0,"Unknown",null,""]
[29,31,"Mc Ginley","Lizzie","126 Bogside",0,"24/04/1894","",0,"Unknown",null,"Second daughter of Michael Mc Ginley Builder."]
[30,3,"Macdevette","James","62 William Street",70,"14/04/1873","",0,"Unknown",null,""]
[31,4,"McLaughlin","Margaret","Ferguson Street",38,"19/03/1873","",0,"Unknown",null,"Daughter of the late Andrew Mc Laughlin"]
[32,1,"Mehan","James","",19,"12/02/1851","",1,"North Door Graveyard",1,""]
[33,2,"Mehan","Joseph","",2,"15/12/1832","",1,"North Door Graveyard",1,""]
[34,3,"Mehan","William","",3,"","",1,"North Door Graveyard",1,""]
[35,4,"Mehan","Joseph","",14,"01/01/1846","",1,"North Door Graveyard",1,""]
[36,5,"Kelly","Cornelius","",51,"22/03/1833","R.N. Surgeon",1,"North Door Graveyard",2,""]
[37,6,"Kelly","Thomas Patrick","",1,"24/06/1823","",1,"North Door Graveyard",2,"Son of No 5"]
[38,7,"Mc Daid","James","",null,"","",1,"North Door Graveyard",3,""]
[39,8,"Mc Daid","Ellen","",null,"10/10/1897","",1,"North Door Graveyard",3,"Wife of No 7"]
[40,9,"Mc Daid","Richard","",null,"29/04/1916","",1,"North Door Graveyard",3,"Son of No's 7 and 8"]
[41,10,"O'Scally","John","",68,"11/06/1824","Captain",1,"North Door Graveyard",4,""]
[42,11,"Mc Feely","Ann","",25,"06/06/1833","",1,"North Door Graveyard",4,"Daughter of No 10"]
[43,12,"Mc Feely","John","Foyle St",28,"24/09/1860","",1,"North Door Graveyard",4,"Son of No 11"]
[44,13,"Devlin","Robert","",34,"13/02/1840","",1,"North Door Graveyard",5,""]
[45,14,"Devlin","William","",null,"","",1,"North Door Graveyard",5,"Son of No 13"]
[46,15,"Devlin","James","",null,"","",1,"North Door Graveyard",5,"Son of No 13"]
[47,16,"Devlin","Maria","",null,"","",1,"North Door Graveyard",5,"Daughter of No 13"]
[48,17,"Casey","Hugh","",51,"02/07/1838","",1,"North Door Graveyard",6,""]
[49,18,"Casey","Margaret","",21,"19/11/1843","",1,"North Door Graveyard",6," Daughter of No 17"]
[50,19,"Doherty","Margaret","",80,"12/09/1859","",1,"North Door Graveyard",6,"Mother-in-Law to No 17"]
[51,20,"Collins","Anthony","",51,"16/11/1837","",1,"North Door Graveyard",7,""]
[52,21,"Collins","Sarah","",62,"05/05/1844","",1,"North Door Graveyard",7,"Wife of No 20"]
[53,22,"Collins","Anthony","",36,"02/12/1852","",1,"North Door Graveyard",7,"Son of 20 and 21"]
[54,23,"Collins","Ann","",17,"21/05/1858","",1,"North Door Graveyard",7,"Grand-daughter of 20 and 21"]
[55,24,"Collins","William","",73,"11/10/1880","",1,"North Door Graveyard",7,""]
[56,25,"Collins","Rose","10 Wiliiam Street",72,"05/10/1885","",1,"North Door Graveyard",7,"Wife of No 24"]
[57,26,"Collins","Catherine","10 William Street",36,"23/05/1886","",1,"North Door Graveyard",7,"Daughter of No 24 and 25"]
[58,27,"Collins","Mary","",42,"10/01/1901","",1,"North Door Graveyard",7,"."]
[59,28,"Collins","Anthony","",null,"28/12/1921","",1,"North Door Graveyard",7,""]
[60,29,"Mooney","Margaret","",33,"","",1,"North Door Graveyard",8,""]
[61,30,"Mooney","Ann","",42,"","",1,"North Door Graveyard",8,""]
[62,31,"Mooney","Joseph","",52,"05/02/1852","",1,"North Door Graveyard",8,""]
[63,32,"White","Mary Jane","",27,"16/04/1853","",1,"North Door Graveyard",8,"Daughter of Thomas White"]
[64,33,"Mooney","Jane","",50,"12/07/1848","",1,"North Door Graveyard",8,""]
[65,34,"Mooney","Rosa","20 Gt James Street",76,"02/02/1860","",1,{"$f":"VLOOKUP(I67,Graveyards,2,2)","v":"North Door Graveyard"},8,""]
[66,35,"Hassan","Elizabeth","",74,"16/02/1870","",1,"North Door Graveyard",8,"Servant to Mooneys 50 yrs"]
[67,36,"Mooney","John","",64,"02/04/1813","",1,"North Door Graveyard",8,""]
[68,37,"Mooney","Anne","",74,"16/06/1827","",1,"North Door Graveyard",8,"Wife of No 36"]
[69,38,"Murray","Thomas","",null,"","",1,"North Door Graveyard",9,"Burying Ground Only"]
[70,39,"Nugent","John","",46,"07/03/1848","",1,"North Door Graveyard",10,""]
[71,40,"Brown","Mary Ann","",25,"05/03/1850","",1,"North Door Graveyard",10,"Daughter of No 39"]
[72,41,"Brown","John","",1,"17/06/1849","",1,"North Door Graveyard",10,"Son of No 40"]
[73,42,"Nugent","Mary","5 Foyle St.",78,"20/05/1877","",1,"North Door Graveyard",10,"Wife of No 39"]
[74,43,"Mc Laughlin","Maggie G","",26,"05/03/1884","",1,"North Door Graveyard",10,"Granddaughter of No 39"]
[75,44,"Mc Laughlin","Ellen Nugent","",76,"24/11/1905","",1,"North Door Graveyard",10,"Daughter of No 39"]
[76,45,"Casey","Phillip","",84,"14/09/1832","",1,"North Door Graveyard",11,""]
[77,46,"Casey","Cecilia","",79,"23/03/1843","",1,"North Door Graveyard",11,"Wife of No 45"]
[78,47,"Fleming","Charles","Castle Street",71,"07/01/1890","",1,"North Door Graveyard",12,""]
[79,48,"O'Donnell","Thomas","Foyle Road",87,"27/07/1861","",1,"North Door Graveyard",13,""]
[80,49,"O'Donnell","Esther","Foyle Road",74,"21/10/1868","",1,"North Door Graveyard",13,"Wife of No 48"]
[81,50,"O'Donnell","William","Foyle Road",72,"21/02/1909","",1,"North Door Graveyard",13,"Son of No,s 48 and 49"]
[82,51,"O'Donnell","Mary","Foyle Road",null,"06/03/1879","",1,"North Door Graveyard",13,"Daughter of No,s 48 and 49"]
[83,52,"O.Donnell","Thomas","Foyle Road",null,"28/02/1898","",1,"North Door Graveyard",13,"Son of No,s 48 and 49"]
[84,53,"O.Donnell","Esther","Foyle Road",null,"11/03/1909","",1,"North Door Graveyard",13,"Daughter of No,s 48 and 49"]
[85,54,"Mc Kinney","Ellen","",15,"07/07/1852","",1,"North Door Graveyard",14,""]
[86,55,"Doherty","Sarah","",null,"","",1,"North Door Graveyard",15,"Wife of William Doherty"]
[87,56,"Mc Feely","Bridget","",28,"19/11/1827","",1,"North Door Graveyard",16,""]
[88,57,"Mc Feely","Bryan","",53,"01/05/1850","",1,"North Door Graveyard",16,""]
[89,58,"Mc Feely","Ellen","",56,"19/11/1846","",1,"North Door Graveyard",16,""]
[90,59,"Mc Feely","Mary","Foyle Street",45,"04/11/1851","",1,"North Door Graveyard",16,""]
[91,60,"Mc Feely","Michael","",77,"29/06/1868","",1,"North Door Graveyard",16,""]
[92,61,"Mc Feely","Michael","Foyle St.",33,"18/06/1872","",1,"North Door Graveyard",16,"only Surviving Son of Late Michael Mc Feely"]
[93,62,"Keys","George","Creevagh",99,"15/11/1903","",1,"North Door Graveyard",17,"Uncle of Bp J K O'Doherty"]
[94,63,"Heaney","Bernard","",57,"19/02/1857","",1,"North Door Graveyard",18,""]
[95,64,"Heaney","Bridget","9 Henrietta St",72,"15/12/1862","",1,"North Door Graveyard",18,"Wife of No 63"]
[96,65,"Griffin","Mary Ann","",25,"13/11/1826","",1,"North Door Graveyard",19,"Wife of Michael Griffin"]
[97,66,"Mc Clean","Dr William","Butcher St Derry",23,"05/09/1833","",1,"North Door Graveyard",20,""]
[98,67,"Mc Clean","Charles","",12,"09/02/1842","",1,"North Door Graveyard",20,"Brother of No 66"]
[99,68,"Mc Clean","Patrick","",23,"17/02/1850","",1,"North Door Graveyard",20,"Brother of No 66"]
[100,69,"Mc Clean","Neal","Butcher St",34,"29/01/1851","",1,"North Door Graveyard",20,"Brother of No 66"]
[101,70,"Mc Clean","Neal Snr","Butcher St",73,"07/04/1851","",1,"North Door Graveyard",20,"Father of No,s 66,67,68,69"]
[102,71,"Doherty","Margaret","",70,"10/12/1920","",1,"North Door Graveyard",21,""]
[103,72,"Doherty","Daniel","",null,"14/12/1914","",1,"North Door Graveyard",21,"Husband of No 71"]
[104,73,"Gill","Ann","",60,"","",1,"North Door Graveyard",null,""]
[105,74,"Mc Cafferty","Andrew","Woodlands, Fahan",69,"16/05/1888","",1,"North Door Graveyard",22,""]
[106,75,"Mc Cafferty","Margaret","",79,"18/03/1894","",1,"North Door Graveyard",22,"Wife of No 74"]
[107,76,"Mc Cafferty","Margaret","Victoria Place",29,"11/10/1873","",1,"North Door Graveyard",22,"Daughter of Andrew, Victoria Place"]
[108,77,"Mc Cafferty","Daniel","",null,"17/06/1885","",1,"North Door Graveyard",22,""]
[109,78,"Mc Cafferty","Andrew","",null,"","",1,"North Door Graveyard",22,"Died in Infancy"]
[110,79,"Mc Cafferty","James","",null,"","",1,"North Door Graveyard",22,"Died in Infancy"]
[111,80,"Mc Cafferty","Annie","",null,"","",1,"North Door Graveyard",22,"Died in Infancy"]
[112,81,"Mc Cafferty","Joseph","No Record",null,"20/11/1885","",1,"North Door Graveyard",22,""]
[113,82,"Mc Cafferty","Mary","Woodlands, Fahan.",null,"25/10/1896","",1,"North Door Graveyard",22,""]
[114,83,"Mc Cafferty","Andrew","18 Clooney terrace",43,"26/02/1893","Solicitor",1,"North Door Graveyard",22,"Interred in City Cemetery"]
[115,84,"Henry","Henry","",null,"","",1,"North Door Graveyard",22,"Grandparents"]
[116,85,"Henry","Mary","",null,"","",1,"North Door Graveyard",22,"to above"]
[117,86,"O'Doherty","Edward","Formerly of Molenan, Died at Whitehouse.",84,"09/05/1872","",1,"North Door Graveyard",23,"Father of Bp J K O'Doherty"]
[118,87,"O'Doherty","Margaret","",66,"13/09/1869","",1,"North Door Graveyard",23,"Mother of Bp J K O'Doherty"]
{"$rows_left_out":433}
{"sheet":"Graveyards","index":2,"n_rows":7,"n_cols":3,"rows_kept":7,"cut":false,"hidden":false,"merged":[]}
[null,"#","Graveyard descriptions."]
[null,0,"Unknown"]
[null,1,"North Door Graveyard"]
[null,2,"Long Tower Girls School Graveyard"]
[null,3,"Long Tower Boys School Graveyard "]
[null,4,"East Door Graveyard"]
[null,5,"West Door Graveyard"]

{"sheet":"Search ","index":3,"n_rows":32,"n_cols":28,"rows_kept":32,"cut":false,"hidden":false,"merged":[[24,6,24,7],[26,6,26,11],[20,6,20,7],[20,2,20,4],[20,8,20,11],[18,6,18,13],[2,1,3,25],[10,6,10,11],[12,6,12,11],[14,6,14,7],[16,6,16,9]]}
[]
[null,550]
[null,"S E A R C H     F O R M"]
[]
[]
[]
[]
[]
[]
[]
[null,null,null,null,null,null,{"$f":"INDEX(Aras_DB!A3:L552,'Search '!B2,5)","v":""}]
[]
[null,null,null,null,null,null,{"$f":"INDEX(Aras_DB!A3:L552,'Search '!B2,7)","v":"01/11/1851"}]
[]
[null,null,null,null,null,null,{"$f":"INDEX(Aras_DB!A3:L552,'Search '!B2,6)","v":65}]
[]
[null,null,null,null,null,null,{"$f":"INDEX(Aras_DB!A3:L552,'Search '!B2,8)","v":""}]
[]
[null,null,null,null,null,null,{"$f":"INDEX(Aras_DB!A3:L552,'Search '!B2,12)","v":""}]
[]
[null,null,"ID_OLD :",null,null,null,{"$f":"INDEX(Aras_DB!A3:L552,'Search '!B2,2)","v":71},null,"(Referenced in Other Comments)"]
[]
[]
[]
[null,null,null,null,null,null,{"$f":"INDEX(Aras_DB!A3:L552,'Search '!B2,11)","v":0}]
[]
[null,null,null,null,null,null,{"$f":"INDEX(Aras_DB!A3:L552,'Search '!B2,10)","v":"West Door Graveyard"}]
[]
[]
[]
[]
[null,null,null,null,null,null,null,null,null,null,null,null,null,null,null,null,null,null,null,null,null,null,null,null,null,null,null," "]